build error
Jay Liew
jay.liew at ml.freebsd.jaysern.org
Sat Mar 20 18:19:14 PST 2004
The following are the last few lines of the error output .. I'm using
4.9 RELEASE .. ideas for a solution, anyone?
Hmm... The next patch looks like a unified diff to me...
The text leading up to this was:
--------------------------
|Index: control/make/common/Defs-bsd.gmk
|===================================================================
|RCS file: control/make/common/Defs-bsd.gmk
|diff -N control/make/common/Defs-bsd.gmk
|--- control/make/common/Defs-bsd.gmk 1 Jan 1970 00:00:00 -0000
...skipping...
--------------------------
|Index: j2se/src/solaris/native/sun/nio/ch/Net.c
|===================================================================
|RCS file:
/var/jcvs/javasrc_1_4_scsl/j2se/src/solaris/native/sun/nio/ch/Net.c,v
|retrieving revision 1.1.1.3
|retrieving revision 1.6
|diff -u -r1.1.1.3 -r1.6
|--- j2se/src/solaris/native/sun/nio/ch/Net.c 22 Oct 2003 23:03:50
-0000 1.1.1.3
|+++ j2se/src/solaris/native/sun/nio/ch/Net.c 27 Oct 2003 12:16:42
-0000 1.6
--------------------------
Patching file j2se/src/solaris/native/sun/nio/ch/Net.c using Plan A...
Hunk #1 succeeded at 283.
done
{standard input}: Assembler messages:
{standard input}:63816: Warning: end of file not at end of a line;
newline inserted
g++: Internal compiler error: program cc1plus got fatal signal 9
gmake[3]: *** [ad_i486_gen.o] Error 1
gmake[2]: *** [the_vm] Error 2
gmake[1]: *** [jvmg] Error 2
gmake: *** [jvmg] Error 2
--
Jay Sern Liew <liew at jaysern.org>
liew.jaysern.org
More information about the freebsd-java
mailing list