Build failure

Woody ohlund at woodwrecker.com
Thu Apr 14 03:06:18 UTC 2011


I've repeated tried to get the vte port built and it continues to fail. 
I've CVSUP'd the ports tree, done a portmaster -a, cleared out the 
packages and to no avail. Attached is the log file from gnomelogalyzer. 
Please help!


~Mark.
-- 
This message has been scanned for viruses and
dangerous content by MailScanner, and is
believed to be clean.

-------------- next part --------------
===>  Building for vte-0.26.2
gmake  all-recursive
gmake[1]: Entering directory `/usr/ports/x11-toolkits/vte/work/vte-0.26.2'
Making all in src
gmake[2]: Entering directory `/usr/ports/x11-toolkits/vte/work/vte-0.26.2/src'
  GEN    vtetypebuiltins.c
gmake  all-am
gmake[3]: Entering directory `/usr/ports/x11-toolkits/vte/work/vte-0.26.2/src'
  GEN    vtetypebuiltins.c
gmake[3]: Leaving directory `/usr/ports/x11-toolkits/vte/work/vte-0.26.2/src'
gmake[2]: Leaving directory `/usr/ports/x11-toolkits/vte/work/vte-0.26.2/src'
Making all in termcaps
gmake[2]: Entering directory `/usr/ports/x11-toolkits/vte/work/vte-0.26.2/termcaps'
gmake[2]: Nothing to be done for `all'.
gmake[2]: Leaving directory `/usr/ports/x11-toolkits/vte/work/vte-0.26.2/termcaps'
Making all in po
gmake[2]: Entering directory `/usr/ports/x11-toolkits/vte/work/vte-0.26.2/po'
gmake[2]: Nothing to be done for `all'.
gmake[2]: Leaving directory `/usr/ports/x11-toolkits/vte/work/vte-0.26.2/po'
Making all in doc
gmake[2]: Entering directory `/usr/ports/x11-toolkits/vte/work/vte-0.26.2/doc'
Making all in reference
gmake[3]: Entering directory `/usr/ports/x11-toolkits/vte/work/vte-0.26.2/doc/reference'
gmake[3]: Nothing to be done for `all'.
gmake[3]: Leaving directory `/usr/ports/x11-toolkits/vte/work/vte-0.26.2/doc/reference'
Making all in openi18n
gmake[3]: Entering directory `/usr/ports/x11-toolkits/vte/work/vte-0.26.2/doc/openi18n'
gmake[3]: Nothing to be done for `all'.
gmake[3]: Leaving directory `/usr/ports/x11-toolkits/vte/work/vte-0.26.2/doc/openi18n'
gmake[3]: Entering directory `/usr/ports/x11-toolkits/vte/work/vte-0.26.2/doc'
gmake[3]: Nothing to be done for `all-am'.
gmake[3]: Leaving directory `/usr/ports/x11-toolkits/vte/work/vte-0.26.2/doc'
gmake[2]: Leaving directory `/usr/ports/x11-toolkits/vte/work/vte-0.26.2/doc'
Making all in perf
gmake[2]: Entering directory `/usr/ports/x11-toolkits/vte/work/vte-0.26.2/perf'
gmake[2]: Nothing to be done for `all'.
gmake[2]: Leaving directory `/usr/ports/x11-toolkits/vte/work/vte-0.26.2/perf'
Making all in python
gmake[2]: Entering directory `/usr/ports/x11-toolkits/vte/work/vte-0.26.2/python'
gmake[2]: Nothing to be done for `all'.
gmake[2]: Leaving directory `/usr/ports/x11-toolkits/vte/work/vte-0.26.2/python'
Making all in gnome-pty-helper
gmake[2]: Entering directory `/usr/ports/x11-toolkits/vte/work/vte-0.26.2/gnome-pty-helper'
gmake  all-am
gmake[3]: Entering directory `/usr/ports/x11-toolkits/vte/work/vte-0.26.2/gnome-pty-helper'
cc -DHAVE_CONFIG_H -I.   -I/usr/local/include  -O2 -pipe -fno-strict-aliasing -MT gnome-utmp.o -MD -MP -MF .deps/gnome-utmp.Tpo -c -o gnome-utmp.o gnome-utmp.c
gnome-utmp.c: In function 'write_login_record':
gnome-utmp.c:367: warning: passing argument 1 of 'login' from incompatible pointer type
gnome-utmp.c:374: error: 'struct utmpx' has no member named 'ut_name'
gmake[3]: *** [gnome-utmp.o] Error 1
gmake[3]: Leaving directory `/usr/ports/x11-toolkits/vte/work/vte-0.26.2/gnome-pty-helper'
gmake[2]: *** [all] Error 2
gmake[2]: Leaving directory `/usr/ports/x11-toolkits/vte/work/vte-0.26.2/gnome-pty-helper'
gmake[1]: *** [all-recursive] Error 1
gmake[1]: Leaving directory `/usr/ports/x11-toolkits/vte/work/vte-0.26.2'
gmake: *** [all] Error 2
*** Error code 1

Stop in /usr/ports/x11-toolkits/vte.
*** Error code 1

Stop in /usr/ports/x11-toolkits/vte.


More information about the freebsd-gnome mailing list