svn commit: r455167 - in head: archivers/snappy-java astro/tkgeomap audio/beast audio/bristol audio/deadbeef audio/funktrackergold audio/gervill audio/gstreamer-plugins-taglib audio/gstreamer1-plug...
Mark Linimon
linimon at FreeBSD.org
Thu Nov 30 06:13:46 UTC 2017
Author: linimon
Date: Thu Nov 30 06:13:34 2017
New Revision: 455167
URL: https://svnweb.freebsd.org/changeset/ports/455167
Log:
For ports that are marked BROKEN on armv6, and also fail to build on
armv7, mark them so.
This is part two of a multipart commit to bring armv7 ports to parity
with armv6.
Approved by: portmgr (tier-2 blanket)
Obtained from: lonesome.com -exp run
Modified:
head/archivers/snappy-java/Makefile
head/astro/tkgeomap/Makefile
head/audio/beast/Makefile
head/audio/bristol/Makefile
head/audio/deadbeef/Makefile
head/audio/funktrackergold/Makefile
head/audio/gervill/Makefile
head/audio/gstreamer-plugins-taglib/Makefile
head/audio/gstreamer1-plugins-taglib/Makefile
head/audio/xmcd/Makefile
head/benchmarks/libmicro/Makefile
head/biology/avida/Makefile
head/biology/bedtools/Makefile
head/biology/bwa/Makefile
head/biology/crux/Makefile
head/biology/gmap/Makefile
head/cad/layouteditor/Makefile
head/cad/libopencad/Makefile
head/chinese/pyzy/Makefile
head/comms/linrad/Makefile
head/comms/rxtx/Makefile
head/converters/wkhtmltopdf/Makefile
head/databases/galera/Makefile
head/databases/libpbl/Makefile
head/databases/percona-pam-for-mysql/Makefile
head/databases/percona55-client/Makefile
head/databases/rocksdb/Makefile
head/databases/sqliteodbc-sqlite2/Makefile
head/databases/tokyocabinet/Makefile
head/databases/xapian-core10/Makefile
head/databases/xtrabackup/Makefile
head/devel/amd64-gcc/Makefile
head/devel/arm-none-eabi-gcc492/Makefile
head/devel/avro-c/Makefile
head/devel/aws-sdk-cpp/Makefile
head/devel/bazel/Makefile
head/devel/charva/Makefile
head/devel/directfb/Makefile
head/devel/dmucs/Makefile
head/devel/dyncall/Makefile
head/devel/elfutils/Makefile
head/devel/flexdock/Makefile
head/devel/guile-lib/Makefile
head/devel/jakarta-commons-daemon/Makefile
head/devel/jna/Makefile
head/devel/k8048/Makefile
head/devel/kyra/Makefile
head/devel/libbfd/Makefile
head/devel/lpc21isp/Makefile
head/devel/obby/Makefile
head/devel/php-uprofiler/Makefile
head/devel/py-jcc/Makefile
head/devel/smv/Makefile
head/devel/statcvs/Makefile
head/devel/tesla/Makefile
head/dns/dnsutl/Makefile
head/dns/powerdns-recursor/Makefile
head/editors/mp/Makefile
head/editors/texmacs/Makefile
head/editors/yui/Makefile
head/emulators/adamem/Makefile
head/emulators/catapult/Makefile
head/emulators/dtcyber/Makefile
head/emulators/gem5/Makefile
head/emulators/unicorn/Makefile
head/emulators/visualboyadvance-m/Makefile
head/ftp/ftpcopy/Makefile
head/ftp/wxdfast/Makefile
head/games/0ad/Makefile
head/games/cataclysm-dda/Makefile
head/games/crafty-tablebase-no-pawn/Makefile
head/games/dhewm3/Makefile
head/games/exult/Makefile
head/games/fkiss/Makefile
head/games/flyhard/Makefile
head/games/ivan/Makefile
head/games/jinput/Makefile
head/games/macopix/Makefile
head/games/nazghul/Makefile
head/games/netradiant/Makefile
head/games/oolite/Makefile
head/games/residualvm/Makefile
head/games/stockfish/Makefile
head/games/trigger-rally/Makefile
head/german/hunspell/Makefile
head/graphics/aseprite/Makefile
head/graphics/code-eli/Makefile
head/graphics/exact-image/Makefile
head/graphics/exrtools/Makefile
head/graphics/hiptext/Makefile
head/graphics/lightzone/Makefile
head/graphics/opencolorio/Makefile
head/graphics/pencil/Makefile
head/graphics/picpuz/Makefile
head/graphics/pixie/Makefile
head/graphics/s10sh/Makefile
head/irc/srvx/Makefile
head/japanese/mutt-devel/Makefile
head/java/berkeley-db/Makefile
head/java/classpath/Makefile
head/java/jakarta-regexp/Makefile
head/java/java-cup/Makefile
head/java/java3d/Makefile
head/java/jcommon/Makefile
head/java/sigar/Makefile
head/lang/abcl/Makefile
head/lang/afnix/Makefile
head/lang/cling/Makefile
head/lang/dmd2/Makefile
head/lang/gauche/Makefile
head/lang/hugs/Makefile
head/lang/io/Makefile
head/lang/ldc/Makefile
head/lang/micropython/Makefile
head/lang/mosh/Makefile
head/lang/nim/Makefile
head/lang/onyx/Makefile
head/lang/pfe/Makefile
head/lang/qore/Makefile
head/lang/rexx-imc/Makefile
head/lang/rexx-regina/Makefile
head/lang/scm/Makefile
head/lang/see/Makefile
head/lang/siod/Makefile
head/lang/spidermonkey17/Makefile
head/mail/bogofilter/Makefile
head/mail/cyrus-imapd25/Makefile
head/mail/usendmail/Makefile
head/math/algae/Makefile
head/math/coq/Makefile
head/math/gambit/Makefile
head/math/gotoblas/Makefile
head/math/jakarta-commons-math3/Makefile
head/math/openlibm/Makefile
head/misc/bb/Makefile
head/misc/estic/Makefile
head/misc/freeguide/Makefile
head/multimedia/gstreamer-plugins-mpeg2enc/Makefile
head/multimedia/gstreamer1-plugins-mpeg2enc/Makefile
head/multimedia/kissdx/Makefile
head/multimedia/libde265/Makefile
head/multimedia/mkclean/Makefile
head/net-im/gale/Makefile
head/net-im/pidgin-sipe/Makefile
head/net-mgmt/fastnetmon/Makefile
head/net/aoe/Makefile
head/net/ipsvd/Makefile
head/net/isboot-kmod/Makefile
head/net/l2tpd/Makefile
head/net/linknx/Makefile
head/net/openmpi2/Makefile
head/net/py-libnet/Makefile
head/net/spread-j/Makefile
head/net/zerotier/Makefile
head/print/pdf-renderer/Makefile
head/russian/ircd-hybrid/Makefile
head/science/cdcl/Makefile
head/science/cdf/Makefile
head/security/hpenc/Makefile
head/security/libprelude/Makefile
head/security/pecl-crypto/Makefile
head/security/poly1305aes/Makefile
head/security/sha1collisiondetection/Makefile
head/sysutils/asmon/Makefile
head/sysutils/dc3dd/Makefile
head/sysutils/geomWatch/Makefile
head/sysutils/ipdbtools/Makefile
head/sysutils/jobd/Makefile
head/sysutils/muse/Makefile
head/sysutils/rovclock/Makefile
head/sysutils/sformat/Makefile
head/sysutils/showbeastie/Makefile
head/sysutils/uschedule/Makefile
head/sysutils/wmmemfree/Makefile
head/textproc/jing/Makefile
head/textproc/randlm/Makefile
head/textproc/senna/Makefile
head/textproc/trang/Makefile
head/www/anyterm/Makefile
head/www/apache-forrest/Makefile
head/www/ctemplate/Makefile
head/www/libhpack/Makefile
head/www/mongrel2/Makefile
head/x11-drivers/xf86-video-siliconmotion/Makefile
head/x11-drivers/xf86-video-tseng/Makefile
head/x11-servers/x11rdp/Makefile
head/x11-toolkits/gnustep-gui/Makefile
head/x11/metisse/Makefile
head/x11/xgrab/Makefile
Modified: head/archivers/snappy-java/Makefile
==============================================================================
--- head/archivers/snappy-java/Makefile Thu Nov 30 06:09:27 2017 (r455166)
+++ head/archivers/snappy-java/Makefile Thu Nov 30 06:13:34 2017 (r455167)
@@ -26,6 +26,7 @@ LICENSE= APACHE20
BUILD_DEPENDS= ${LOCALBASE}/share/java/maven3/bin/mvn:devel/maven3
BROKEN_armv6= fails to build: maven-assembly-plugin: Failed to retrieve numeric file attributes
+BROKEN_armv7= fails to build: maven-assembly-plugin: Failed to retrieve numeric file attributes
USE_GITHUB= yes
GH_ACCOUNT= xerial
Modified: head/astro/tkgeomap/Makefile
==============================================================================
--- head/astro/tkgeomap/Makefile Thu Nov 30 06:09:27 2017 (r455166)
+++ head/astro/tkgeomap/Makefile Thu Nov 30 06:13:34 2017 (r455167)
@@ -14,6 +14,7 @@ LICENSE= GPLv2
LIB_DEPENDS= libtclgeomap.so:astro/tclgeomap
BROKEN_armv6= fails to configure: shared build specified but could not find shared tclgeomap library
+BROKEN_armv7= fails to configure: shared build specified but could not find shared tclgeomap library
USES+= tk:tea
CONFIGURE_ARGS= --with-tclgeomap-include=${LOCALBASE}/include/tclgeomap --with-x \
Modified: head/audio/beast/Makefile
==============================================================================
--- head/audio/beast/Makefile Thu Nov 30 06:09:27 2017 (r455166)
+++ head/audio/beast/Makefile Thu Nov 30 06:13:34 2017 (r455167)
@@ -22,6 +22,7 @@ LIB_DEPENDS= libasound.so:audio/alsa-lib \
RUN_DEPENDS= xdg-open:devel/xdg-utils
BROKEN_armv6= fails to package: bseblockutils.SSE.so: No such file or directory
+BROKEN_armv7= fails to package: bseblockutils.SSE.so: No such file or directory
BROKEN_powerpc64= fails to package: bseblockutils.SSE.so: No such file or directory
USES= desktop-file-utils gettext gmake libtool pathfix pkgconfig \
Modified: head/audio/bristol/Makefile
==============================================================================
--- head/audio/bristol/Makefile Thu Nov 30 06:09:27 2017 (r455166)
+++ head/audio/bristol/Makefile Thu Nov 30 06:13:34 2017 (r455167)
@@ -27,6 +27,7 @@ CONFIGURE_ARGS+= --disable-alsa --enable-oss \
BROKEN_aarch64= Does not build: error: unknown FP unit 'sse'
BROKEN_armv6= Does not build: error: unknown FP unit 'sse'
+BROKEN_armv7= Does not build: error: unknown FP unit 'sse'
BROKEN_mips64= Does not build: error: unknown FP unit 'sse'
BROKEN_powerpc64= Does not build: error: unknown FP unit 'sse'
Modified: head/audio/deadbeef/Makefile
==============================================================================
--- head/audio/deadbeef/Makefile Thu Nov 30 06:09:27 2017 (r455166)
+++ head/audio/deadbeef/Makefile Thu Nov 30 06:13:34 2017 (r455167)
@@ -30,6 +30,7 @@ INSTALL_TARGET= install-strip
BROKEN_aarch64= Fails to compile: error in backend: Do not know how to split this operator's operand!
BROKEN_armv6= Fails to compile: error: invalid conversion between vector type and integer type
+BROKEN_armv7= Fails to compile: error: invalid conversion between vector type and integer type
OPTIONS_DEFINE= PULSEAUDIO GUI VFS LASTFM ART SUPEREQ SID FFAP VTX \
HOTKEYS OGG FFMPEG FLAC SNDFILE WAVPACK CDDA GME DUMB NOTIFY \
Modified: head/audio/funktrackergold/Makefile
==============================================================================
--- head/audio/funktrackergold/Makefile Thu Nov 30 06:09:27 2017 (r455166)
+++ head/audio/funktrackergold/Makefile Thu Nov 30 06:13:34 2017 (r455167)
@@ -23,6 +23,7 @@ PORTDOCS= INSTALL
PLIST_FILES= bin/funkgold
BROKEN_armv6= fails to compile: function definition is not allowed here
+BROKEN_armv7= fails to compile: function definition is not allowed here
BROKEN_mips= fails to compile: nested functions are disabled, use -fnested-functions to re-enable
BROKEN_mips64= fails to compile: nested functions are disabled, use -fnested-functions to re-enable
BROKEN_powerpc64= fails to compile: nested functions are disabled, use -fnested-functions to re-enable
Modified: head/audio/gervill/Makefile
==============================================================================
--- head/audio/gervill/Makefile Thu Nov 30 06:09:27 2017 (r455166)
+++ head/audio/gervill/Makefile Thu Nov 30 06:13:34 2017 (r455167)
@@ -13,6 +13,7 @@ LICENSE= GPLv2 # only
LICENSE_FILE= ${WRKSRC}/LICENSE
BROKEN_armv6= fails to package: find: *: No such file or directory
+BROKEN_armv7= fails to package: find: *: No such file or directory
USES= zip
USE_JAVA= yes
Modified: head/audio/gstreamer-plugins-taglib/Makefile
==============================================================================
--- head/audio/gstreamer-plugins-taglib/Makefile Thu Nov 30 06:09:27 2017 (r455166)
+++ head/audio/gstreamer-plugins-taglib/Makefile Thu Nov 30 06:13:34 2017 (r455167)
@@ -8,6 +8,7 @@ CATEGORIES= audio
COMMENT= Gstreamer taglib plugin
BROKEN_armv6= fails to compile: textidentificationframe.h file not found
+BROKEN_armv7= fails to compile: textidentificationframe.h file not found
GST_PLUGIN= taglib
Modified: head/audio/gstreamer1-plugins-taglib/Makefile
==============================================================================
--- head/audio/gstreamer1-plugins-taglib/Makefile Thu Nov 30 06:09:27 2017 (r455166)
+++ head/audio/gstreamer1-plugins-taglib/Makefile Thu Nov 30 06:13:34 2017 (r455167)
@@ -6,6 +6,7 @@ CATEGORIES= audio
COMMENT= GStreamer taglib plugin for adding APEv2 and ID3v2 headers
BROKEN_armv6= fails to compile: textidentificationframe.h file not found
+BROKEN_armv7= fails to compile: textidentificationframe.h file not found
GST_PLUGIN= taglib
DIST= good
Modified: head/audio/xmcd/Makefile
==============================================================================
--- head/audio/xmcd/Makefile Thu Nov 30 06:09:27 2017 (r455166)
+++ head/audio/xmcd/Makefile Thu Nov 30 06:13:34 2017 (r455167)
@@ -24,6 +24,7 @@ LIBBINDIR= ${STAGEDIR}${PREFIX}/lib/X11/xmcd/bin-${OPS
BROKEN_aarch64= Fails to compile: many undefined symbols in xorg.cf
BROKEN_armv6= Fails to compile: many undefined symbols in xorg.cf
+BROKEN_armv7= Fails to install: strip: xmcd/bin-FreeBSD_12-armv7/cda failed: No such file or directory
BROKEN_mips64= Fails to compile: many undefined symbols in xorg.cf
BROKEN_powerpc64= Fails to compile: many undefined symbols in xorg.cf
Modified: head/benchmarks/libmicro/Makefile
==============================================================================
--- head/benchmarks/libmicro/Makefile Thu Nov 30 06:09:27 2017 (r455166)
+++ head/benchmarks/libmicro/Makefile Thu Nov 30 06:13:34 2017 (r455167)
@@ -13,6 +13,7 @@ LICENSE= CDDL
BROKEN_aarch64= Fails to build: bin-aarch64: no such file or directory
BROKEN_armv6= Fails to build: bin-armv6: no such file or directory
+BROKEN_armv7= Fails to build: bin-armv7: no such file or directory
BROKEN_mips64= Fails to build: bin-mips64: no such file or directory
BROKEN_powerpc64= Fails to build: bin-powerpc64: no such file or directory
Modified: head/biology/avida/Makefile
==============================================================================
--- head/biology/avida/Makefile Thu Nov 30 06:09:27 2017 (r455166)
+++ head/biology/avida/Makefile Thu Nov 30 06:13:34 2017 (r455167)
@@ -14,6 +14,7 @@ LICENSE= GPLv3
BROKEN_aarch64= invokes x86 asm
BROKEN_armv6= invokes x86 asm
+BROKEN_armv7= invokes x86 asm
BROKEN_mips= invokes x86 asm
BROKEN_mips64= invokes x86 asm
BROKEN_sparc64= missing atomics implementation
Modified: head/biology/bedtools/Makefile
==============================================================================
--- head/biology/bedtools/Makefile Thu Nov 30 06:09:27 2017 (r455166)
+++ head/biology/bedtools/Makefile Thu Nov 30 06:13:34 2017 (r455167)
@@ -14,6 +14,7 @@ LICENSE= GPLv2
LICENSE_FILE= ${WRKSRC}/LICENSE
BROKEN_armv6= fails to compile: implicit instantiation of undefined template __static_assert_test<false>
+BROKEN_armv7= fails to compile: implicit instantiation of undefined template __static_assert_test<false>
USE_GITHUB= yes
GH_ACCOUNT= arq5x
Modified: head/biology/bwa/Makefile
==============================================================================
--- head/biology/bwa/Makefile Thu Nov 30 06:09:27 2017 (r455166)
+++ head/biology/bwa/Makefile Thu Nov 30 06:13:34 2017 (r455167)
@@ -14,6 +14,7 @@ LICENSE= GPLv3
# From 0.7.9a: Recheck for 0.7.17.
BROKEN_aarch64= fails to compile: invalid conversion between vector type and integer type
BROKEN_armv6= fails to compile: invalid conversion between vector type and integer type
+BROKEN_armv7= fails to compile: invalid conversion between vector type and integer type
BROKEN_mips= fails to compile: cc1: unrecognized command line option "-msse2"
BROKEN_mips64= fails to compile: cc1: unrecognized command line option "-msse2"
BROKEN_powerpc64= fails to compile: ksw.c: emmintrin.h: No such file or directory
Modified: head/biology/crux/Makefile
==============================================================================
--- head/biology/crux/Makefile Thu Nov 30 06:09:27 2017 (r455166)
+++ head/biology/crux/Makefile Thu Nov 30 06:13:34 2017 (r455167)
@@ -16,6 +16,7 @@ LICENSE_COMB= multi
BROKEN= No public distfiles
BROKEN_aarch64= Fails to link: ImportError: /lib/libgcc_s.so.1: version GCC_4.5.0 required by /usr/local/lib/gcc5/libgfortran.so.3 not found
BROKEN_armv6= Fails to link: ImportError: /usr/local/lib/gcc49/libgfortran.so.3: Undefined symbol "__aeabi_ldivmod"
+BROKEN_armv7= Fails to link: ImportError: /usr/local/lib/gcc49/libgfortran.so.3: Undefined symbol "__aeabi_ldivmod"
USES= fortran gmake python tar:bzip2
USE_CSTD= gnu99
Modified: head/biology/gmap/Makefile
==============================================================================
--- head/biology/gmap/Makefile Thu Nov 30 06:09:27 2017 (r455166)
+++ head/biology/gmap/Makefile Thu Nov 30 06:13:34 2017 (r455167)
@@ -26,6 +26,7 @@ SIMD_CONFIGURE_OFF= --disable-builtin-popcount --disab
BROKEN_aarch64= Does not build: invokes x86 asm
BROKEN_armv6= Does not build: invokes x86 asm
+BROKEN_armv7= Does not build: invokes x86 asm
BROKEN_mips64= Does not build: invokes x86 asm
BROKEN_powerpc64= Does not build: invokes x86 asm
BROKEN_sparc64= Does not build: invokes x86 asm
Modified: head/cad/layouteditor/Makefile
==============================================================================
--- head/cad/layouteditor/Makefile Thu Nov 30 06:09:27 2017 (r455166)
+++ head/cad/layouteditor/Makefile Thu Nov 30 06:13:34 2017 (r455167)
@@ -14,6 +14,7 @@ COMMENT= IC/MEMS layout editor
LIB_DEPENDS= libttf.so:print/freetype
BROKEN_armv6= fails to compile: no matching member function for call to 'map'
+BROKEN_armv7= fails to compile: no matching member function for call to 'map'
USES= qmake zip
USE_QT4= corelib gui network moc_build sql uic_build \
Modified: head/cad/libopencad/Makefile
==============================================================================
--- head/cad/libopencad/Makefile Thu Nov 30 06:09:27 2017 (r455166)
+++ head/cad/libopencad/Makefile Thu Nov 30 06:13:34 2017 (r455167)
@@ -13,6 +13,7 @@ LICENSE= MIT
LICENSE_FILE= ${WRKSRC}/LICENSE
BROKEN_armv6= fails to compile: cadheader.cpp: ambiguous conversion for functional-style cast from 'time_t' to 'CADVariant'
+BROKEN_armv7= fails to compile: cadheader.cpp: ambiguous conversion for functional-style cast from 'time_t' to 'CADVariant'
BROKEN_powerpc64= fails to compile: r2000.cpp: 'to_string' was not declared in this scope
USE_GITHUB= yes
Modified: head/chinese/pyzy/Makefile
==============================================================================
--- head/chinese/pyzy/Makefile Thu Nov 30 06:09:27 2017 (r455166)
+++ head/chinese/pyzy/Makefile Thu Nov 30 06:13:34 2017 (r455167)
@@ -23,6 +23,7 @@ USE_LDCONFIG= yes
BROKEN_aarch64= fails to compile: constant expression evaluates to -1
BROKEN_armv6= fails to compile: constant expression evaluates to -1
+BROKEN_armv7= fails to compile: constant expression evaluates to -1
BROKEN_powerpc64= fails to compile: narrowing conversion of '-1' from 'int' to 'char'
GNU_CONFIGURE= yes
Modified: head/comms/linrad/Makefile
==============================================================================
--- head/comms/linrad/Makefile Thu Nov 30 06:09:27 2017 (r455166)
+++ head/comms/linrad/Makefile Thu Nov 30 06:13:34 2017 (r455167)
@@ -33,6 +33,7 @@ LINRAD_DOCFILES= z_APM.txt z_BUFFERS.txt z_CALIBRATE.t
BROKEN_aarch64= fails to compile: implicit declaration of function outb
BROKEN_armv6= fails to configure: can not find /nxb-bin/usr/bin/cc
+BROKEN_armv7= fails to configure: can not find /nxb-bin/usr/bin/cc
BROKEN_powerpc64= fails to compile: implicit declaration of function outb
BROKEN_sparc64= fails to compile: implicit declaration of function outb
Modified: head/comms/rxtx/Makefile
==============================================================================
--- head/comms/rxtx/Makefile Thu Nov 30 06:09:27 2017 (r455166)
+++ head/comms/rxtx/Makefile Thu Nov 30 06:13:34 2017 (r455167)
@@ -16,6 +16,7 @@ LICENSE= LGPL21
LICENSE_FILE= ${WRKSRC}/COPYING
BROKEN_armv6= fails to link: librxtxParallel.so: No such file or directory
+BROKEN_armv7= fails to link: librxtxParallel.so: No such file or directory
USES= gmake libtool zip
Modified: head/converters/wkhtmltopdf/Makefile
==============================================================================
--- head/converters/wkhtmltopdf/Makefile Thu Nov 30 06:09:27 2017 (r455166)
+++ head/converters/wkhtmltopdf/Makefile Thu Nov 30 06:13:34 2017 (r455167)
@@ -26,6 +26,7 @@ HAS_CONFIGURE= yes
BROKEN_aarch64= Does not build: error: cast from pointer to smaller type loses information
BROKEN_armv6= Does not build: error: Not supported ARM architecture
+BROKEN_armv7= Does not build: error: invalid operand for instruction
BROKEN_mips64= Does not link: undefined reference to __sync_add_and_fetch_4
BROKEN_powerpc64= Does not build
Modified: head/databases/galera/Makefile
==============================================================================
--- head/databases/galera/Makefile Thu Nov 30 06:09:27 2017 (r455166)
+++ head/databases/galera/Makefile Thu Nov 30 06:13:34 2017 (r455167)
@@ -17,6 +17,7 @@ LIB_DEPENDS= libboost_date_time.so:devel/boost-libs
BROKEN_aarch64= fails to compile: gu_int128.h: use of undeclared identifier '__bswap64_var'
BROKEN_armv6= fails to compile: gu_int128.h: use of undeclared identifier '__bswap64_var'
+BROKEN_armv7= fails to compile: gu_int128.h: use of undeclared identifier '__bswap64_var'
NOT_FOR_ARCHS= i386
# On i386 older versions of clang produce:
# cannot compile this atomic library call yet ... __atomic_add_fetch
Modified: head/databases/libpbl/Makefile
==============================================================================
--- head/databases/libpbl/Makefile Thu Nov 30 06:09:27 2017 (r455166)
+++ head/databases/libpbl/Makefile Thu Nov 30 06:13:34 2017 (r455167)
@@ -16,6 +16,7 @@ MAKEFILE= makefile
TEST_TARGET= test
BROKEN_armv6= Fails to build: cannot compile pblPerform.c
+BROKEN_armv7= Fails to build: cannot compile pblPerform.c
BROKEN_mips= Fails to build: cannot compile pblPerform.c
WRKSRC= ${WRKDIR}/${DISTNAME}/src
Modified: head/databases/percona-pam-for-mysql/Makefile
==============================================================================
--- head/databases/percona-pam-for-mysql/Makefile Thu Nov 30 06:09:27 2017 (r455166)
+++ head/databases/percona-pam-for-mysql/Makefile Thu Nov 30 06:13:34 2017 (r455167)
@@ -8,6 +8,7 @@ PKGNAMESUFFIX= -pam-for-mysql
COMMENT= PAM plugin for MySQL
BROKEN_armv6= fails to compile: cannot combine with previous 'type-name' declaration specifier
+BROKEN_armv7= fails to compile: cannot combine with previous 'type-name' declaration specifier
BROKEN_mips= fails to configure: CMake Error: Generator: execution of make failed
BROKEN_mips64= fails to configure: CMake Error: Generator: execution of make failed
NOT_FOR_ARCHS= powerpc64
Modified: head/databases/percona55-client/Makefile
==============================================================================
--- head/databases/percona55-client/Makefile Thu Nov 30 06:09:27 2017 (r455166)
+++ head/databases/percona55-client/Makefile Thu Nov 30 06:13:34 2017 (r455167)
@@ -22,6 +22,7 @@ USE_LDCONFIG= ${PREFIX}/lib/mysql
BROKEN_aarch64= Fails to build: error: passing int to parameter of incompatible type va_list
BROKEN_armv6= Fails to build: error: passing int to parameter of incompatible type va_list
+BROKEN_armv7= Fails to build: error: passing int to parameter of incompatible type va_list
MANPAGES= comp_err.1 msql2mysql.1 mysql.1 mysql_config.1 mysql_find_rows.1 \
mysql_waitpid.1 mysqlaccess.1 mysqladmin.1 mysqlbinlog.1 \
Modified: head/databases/rocksdb/Makefile
==============================================================================
--- head/databases/rocksdb/Makefile Thu Nov 30 06:09:27 2017 (r455166)
+++ head/databases/rocksdb/Makefile Thu Nov 30 06:13:34 2017 (r455167)
@@ -17,6 +17,7 @@ LICENSE_FILE_GPLv2= ${WRKSRC}/COPYING
BROKEN_DragonFly= does not build on DragonFly BSD using GCC with -Werror
BROKEN_aarch64= does not build: the clang compiler does not support -march=native
BROKEN_armv6= does not build: the clang compiler does not support -march=native
+BROKEN_armv7= does not build: /nxb-bin/usr/bin/ld: undefined reference to symbol `__gnu_Unwind_Find_exidx@@FBSD_1.4' (try adding -lc)
BROKEN_powerpc64= does not build: the clang compiler does not support -march=native
BROKEN_sparc64= cannot build: uses unknown compiler flags
Modified: head/databases/sqliteodbc-sqlite2/Makefile
==============================================================================
--- head/databases/sqliteodbc-sqlite2/Makefile Thu Nov 30 06:09:27 2017 (r455166)
+++ head/databases/sqliteodbc-sqlite2/Makefile Thu Nov 30 06:13:34 2017 (r455167)
@@ -11,5 +11,6 @@ MASTERDIR= ${.CURDIR}/../sqliteodbc
BROKEN_aarch64= fails to compile: error: passing char * to parameter of incompatible type va_list
BROKEN_armv6= fails to compile: error: passing char * to parameter of incompatible type va_list
+BROKEN_armv7= fails to compile: error: passing char * to parameter of incompatible type va_list
.include "${MASTERDIR}/Makefile"
Modified: head/databases/tokyocabinet/Makefile
==============================================================================
--- head/databases/tokyocabinet/Makefile Thu Nov 30 06:09:27 2017 (r455166)
+++ head/databases/tokyocabinet/Makefile Thu Nov 30 06:13:34 2017 (r455167)
@@ -14,6 +14,7 @@ LICENSE= LGPL21
LICENSE_FILE= ${WRKSRC}/COPYING
BROKEN_armv6= dumps core: Assertion failed: (!NodePtr->isKnownSentinel()), function operator*, file ilist_iterator.h
+BROKEN_armv7= fails to build: cc: error: unable to execute command: Abort trap (core dumped)
GNU_CONFIGURE= yes
USES= pathfix gmake
Modified: head/databases/xapian-core10/Makefile
==============================================================================
--- head/databases/xapian-core10/Makefile Thu Nov 30 06:09:27 2017 (r455166)
+++ head/databases/xapian-core10/Makefile Thu Nov 30 06:13:34 2017 (r455167)
@@ -14,6 +14,7 @@ COMMENT= Probabilistic text search database engine
LICENSE= GPLv2
BROKEN_armv6= fails to install: quartz_log.cc:: error: call to 'om_tostring' is ambiguous
+BROKEN_armv7= fails to install: quartz_log.cc:: error: call to 'om_tostring' is ambiguous
BROKEN_mips= fails to install: quartz_log.cc:: error: call to 'om_tostring' is ambiguous
BROKEN_mips64= fails to install: quartz_log.cc:: error: call to 'om_tostring' is ambiguous
Modified: head/databases/xtrabackup/Makefile
==============================================================================
--- head/databases/xtrabackup/Makefile Thu Nov 30 06:09:27 2017 (r455166)
+++ head/databases/xtrabackup/Makefile Thu Nov 30 06:13:34 2017 (r455167)
@@ -25,6 +25,7 @@ RUN_DEPENDS= p5-DBD-mysql>=0:databases/p5-DBD-mysql \
qpress:archivers/qpress
BROKEN_armv6= fails to compile: cannot combine with previous 'type-name' declaration specifier
+BROKEN_armv7= fails to compile: cannot combine with previous 'type-name' declaration specifier
BROKEN_mips64= fails to compile: 'fpsetmask' was not declared in this scope
BROKEN_powerpc64= fails to link: ld: final link failed: Bad value
Modified: head/devel/amd64-gcc/Makefile
==============================================================================
--- head/devel/amd64-gcc/Makefile Thu Nov 30 06:09:27 2017 (r455166)
+++ head/devel/amd64-gcc/Makefile Thu Nov 30 06:13:34 2017 (r455167)
@@ -10,6 +10,7 @@ FREEBSD_EXTENSION= yes
BROKEN_aarch64= error: invalid output constraint '=a' in asm
BROKEN_armv6= fails to package
+BROKEN_armv7= fails to package
BROKEN_mips= configure: error: cannot compute suffix of object files: cannot compile
BROKEN_mips64= configure: error: cannot compute suffix of object files: cannot compile
BROKEN_powerpc64= error: invalid output constraint in asm
Modified: head/devel/arm-none-eabi-gcc492/Makefile
==============================================================================
--- head/devel/arm-none-eabi-gcc492/Makefile Thu Nov 30 06:09:27 2017 (r455166)
+++ head/devel/arm-none-eabi-gcc492/Makefile Thu Nov 30 06:13:34 2017 (r455167)
@@ -70,6 +70,7 @@ MAKE_ARGS+= CXXFLAGS=-fbracket-depth=512
BROKEN_aarch64= fails to package
BROKEN_armv6= error: no member named 'fancy_abort' in namespace 'std::__1'; did you mean simply 'fancy_abort'?
+BROKEN_armv7= error: no member named 'fancy_abort' in namespace 'std::__1'; did you mean simply 'fancy_abort'?
BROKEN_mips= configure: error: cannot compute suffix of object files: cannot compile
BROKEN_mips64= configure: error: cannot compute suffix of object files: cannot compile
Modified: head/devel/avro-c/Makefile
==============================================================================
--- head/devel/avro-c/Makefile Thu Nov 30 06:09:27 2017 (r455166)
+++ head/devel/avro-c/Makefile Thu Nov 30 06:13:34 2017 (r455167)
@@ -17,6 +17,7 @@ LIB_DEPENDS= libjansson.so:devel/jansson \
BROKEN_aarch64= Fails to build: error: No atomic implementation
BROKEN_armv6= Fails to build: error: No atomic implementation
+BROKEN_armv7= Fails to build: error: No atomic implementation
BROKEN_mips= Fails to build: error: No atomic implementation
BROKEN_mips64= Fails to build: error: No atomic implementation
BROKEN_sparc64= Fails to build
Modified: head/devel/aws-sdk-cpp/Makefile
==============================================================================
--- head/devel/aws-sdk-cpp/Makefile Thu Nov 30 06:09:27 2017 (r455166)
+++ head/devel/aws-sdk-cpp/Makefile Thu Nov 30 06:13:34 2017 (r455167)
@@ -14,6 +14,7 @@ LIB_DEPENDS= libcurl.so:ftp/curl
BROKEN_aarch64= fails to build: runaway process
BROKEN_armv6= fails to build: runaway process
+BROKEN_armv7= fails to build: runaway process
BROKEN_powerpc64= fails to build: runaway process
USE_GITHUB= yes
Modified: head/devel/bazel/Makefile
==============================================================================
--- head/devel/bazel/Makefile Thu Nov 30 06:09:27 2017 (r455166)
+++ head/devel/bazel/Makefile Thu Nov 30 06:13:34 2017 (r455167)
@@ -14,6 +14,7 @@ LICENSE= APACHE20
LICENSE_FILE= ${WRKSRC}/LICENSE
BROKEN_armv6= fails to package: cp: bazel: No such file or directory
+BROKEN_armv7= fails to package: cp: bazel: No such file or directory
BUILD_DEPENDS= bash:shells/bash \
zip:archivers/zip
Modified: head/devel/charva/Makefile
==============================================================================
--- head/devel/charva/Makefile Thu Nov 30 06:09:27 2017 (r455166)
+++ head/devel/charva/Makefile Thu Nov 30 06:13:34 2017 (r455167)
@@ -15,6 +15,7 @@ BUILD_DEPENDS= gmake:devel/gmake
RUN_DEPENDS= ${JAVALIBDIR}/commons-logging.jar:java/jakarta-commons-logging
BROKEN_armv6= fails to compile: build.xml: compilation failed
+BROKEN_armv7= fails to compile: build.xml: compilation failed
OPTIONS_DEFINE= DOCS
Modified: head/devel/directfb/Makefile
==============================================================================
--- head/devel/directfb/Makefile Thu Nov 30 06:09:27 2017 (r455166)
+++ head/devel/directfb/Makefile Thu Nov 30 06:13:34 2017 (r455167)
@@ -30,6 +30,7 @@ PORTDOCS= *
BROKEN_aarch64= fails to install: armasm_memcpy.h:No such file or directory
BROKEN_armv6= fails to compile: invokes x86 assembler
+BROKEN_armv7= fails to compile: invokes x86 assembler
DIRECTFB_SHLIB= 6.0.11 # LT_BINARY.LT_AGE.LT_REVISION
DIRECTFB_BIN= ${DIRECTFB_SHLIB:R:R} # LT_BINARY
@@ -61,13 +62,13 @@ TEST_CONFIGURE_WITH= tests
.include <bsd.port.options.mk>
-.if ${ARCH} == "armv6" || ${ARCH} == "aarch64"
+.if ${ARCH} == aarch64 || ${ARCH} == armv6 || ${ARCH} == armv7
PLIST_SUB+= ARCH_ARM=""
.else
PLIST_SUB+= ARCH_ARM="@comment "
.endif
-.if ${ARCH} == "powerpc" || ${ARCH} == "powerpc64"
+.if ${ARCH} == powerpc || ${ARCH} == powerpc64
PLIST_SUB+= ARCH_POWERPC=""
.else
PLIST_SUB+= ARCH_POWERPC="@comment "
Modified: head/devel/dmucs/Makefile
==============================================================================
--- head/devel/dmucs/Makefile Thu Nov 30 06:09:27 2017 (r455166)
+++ head/devel/dmucs/Makefile Thu Nov 30 06:13:34 2017 (r455167)
@@ -11,6 +11,7 @@ MAINTAINER= fjoe at FreeBSD.org
COMMENT= Distributed Multi-User Compilation System (for use with distcc)
BROKEN_armv6= fails to compile: passing char * to parameter of incompatible type __builtin_va_list
+BROKEN_armv7= fails to compile: passing char * to parameter of incompatible type __builtin_va_list
BROKEN_aarch64= fails to compile: passing char * to parameter of incompatible type __builtin_va_list
WRKSRC= ${WRKDIR}/${PORTNAME}
Modified: head/devel/dyncall/Makefile
==============================================================================
--- head/devel/dyncall/Makefile Thu Nov 30 06:09:27 2017 (r455166)
+++ head/devel/dyncall/Makefile Thu Nov 30 06:13:34 2017 (r455167)
@@ -14,6 +14,7 @@ COMMENT= Highly dynamic multi-platform foreign functio
LICENSE= ISCL
BROKEN_armv6= fails to compile: unexpected token in operand
+BROKEN_armv7= fails to compile: unexpected token in operand
HAS_CONFIGURE= yes
Modified: head/devel/elfutils/Makefile
==============================================================================
--- head/devel/elfutils/Makefile Thu Nov 30 06:09:27 2017 (r455166)
+++ head/devel/elfutils/Makefile Thu Nov 30 06:13:34 2017 (r455167)
@@ -17,6 +17,7 @@ LICENSE_FILE_LGPL3= ${WRKSRC}/COPYING-LGPLV3
BROKEN_aarch64= fails to build: fatal error: linux/uio.h: No such file or directory
BROKEN_armv6= fails to build: fails to compile i386_disasm.c
+BROKEN_armv7= fails to build: fails to compile i386_disasm.c
BROKEN_powerpc64= fails to build: error: field 'r' has incomplete type
BROKEN_sparc64= fails to build: fails to compile dwarf_begin_elf.c
Modified: head/devel/flexdock/Makefile
==============================================================================
--- head/devel/flexdock/Makefile Thu Nov 30 06:09:27 2017 (r455166)
+++ head/devel/flexdock/Makefile Thu Nov 30 06:13:34 2017 (r455167)
@@ -10,6 +10,7 @@ MAINTAINER= makc at FreeBSD.org
COMMENT= Swing windowing and docking framework
BROKEN_armv6= fails to package: flexdock/api: No such file or directory
+BROKEN_armv7= fails to package: flexdock/api: No such file or directory
USE_ANT= yes
USE_JAVA= yes
Modified: head/devel/guile-lib/Makefile
==============================================================================
--- head/devel/guile-lib/Makefile Thu Nov 30 06:09:27 2017 (r455166)
+++ head/devel/guile-lib/Makefile Thu Nov 30 06:13:34 2017 (r455167)
@@ -13,6 +13,7 @@ BUILD_DEPENDS= guile:lang/guile
RUN_DEPENDS= guile:lang/guile
BROKEN_armv6= fails to compile: stack overflow
+BROKEN_armv7= fails to compile: stack overflow
USES= gmake
GNU_CONFIGURE= yes
Modified: head/devel/jakarta-commons-daemon/Makefile
==============================================================================
--- head/devel/jakarta-commons-daemon/Makefile Thu Nov 30 06:09:27 2017 (r455166)
+++ head/devel/jakarta-commons-daemon/Makefile Thu Nov 30 06:13:34 2017 (r455167)
@@ -16,6 +16,7 @@ COMMENT= Wrapper code to start/stop a Java application
LICENSE= APACHE20
BROKEN_armv6= fails to compile: 'jni_md.h' file not found
+BROKEN_armv7= fails to compile: 'jni_md.h' file not found
OPTIONS_DEFINE= DOCS
Modified: head/devel/jna/Makefile
==============================================================================
--- head/devel/jna/Makefile Thu Nov 30 06:09:27 2017 (r455166)
+++ head/devel/jna/Makefile Thu Nov 30 06:13:34 2017 (r455167)
@@ -14,6 +14,7 @@ LICENSE_FILE_LGPL21+ = ${WRKSRC}/LICENSE.LGPL
LICENSE_FILE_APACHE20= ${WRKSRC}/LICENSE.AL
BROKEN_armv6= fails to compile: build.xml: compilation failed
+BROKEN_armv7= fails to compile: build.xml: compilation failed
USES= autoreconf:build gmake libtool
USE_ANT= yes
Modified: head/devel/k8048/Makefile
==============================================================================
--- head/devel/k8048/Makefile Thu Nov 30 06:09:27 2017 (r455166)
+++ head/devel/k8048/Makefile Thu Nov 30 06:13:34 2017 (r455167)
@@ -17,6 +17,7 @@ USES= gmake
ALL_TARGET= build
BROKEN_armv6= fails to compile: invokes x86 asm
+BROKEN_armv7= fails to compile: invokes x86 asm
PLIST_FILES= bin/${PORTNAME} bin/kio ${BIN_SYMLINKS}
Modified: head/devel/kyra/Makefile
==============================================================================
--- head/devel/kyra/Makefile Thu Nov 30 06:09:27 2017 (r455166)
+++ head/devel/kyra/Makefile Thu Nov 30 06:13:34 2017 (r455167)
@@ -28,6 +28,7 @@ MAKE_ARGS= CC="${CC}" CXX="${CXX}" LD="${CXX}" \
BROKEN_aarch64= Fails to compile: error: invalid output constraint =A in asm
BROKEN_armv6= Fails to compile: error: invalid output constraint =A in asm
+BROKEN_armv7= Fails to compile: error: invalid output constraint =A in asm
do-install:
.for i in encoder spriteed
Modified: head/devel/libbfd/Makefile
==============================================================================
--- head/devel/libbfd/Makefile Thu Nov 30 06:09:27 2017 (r455166)
+++ head/devel/libbfd/Makefile Thu Nov 30 06:13:34 2017 (r455167)
@@ -27,6 +27,7 @@ INFO= bfd
BROKEN_aarch64= Fails to configure: machine aarch64-portbld not recognized
BROKEN_armv6= Fails to configure: BFD does not support target armv6-portbld-freebsd12.0
+BROKEN_armv7= Fails to configure: BFD does not support target armv7-portbld-freebsd12.0
BROKEN_mips64= Fails to configure: BFD does not support target mips64-portbld-freebsd12.0
pre-configure:
Modified: head/devel/lpc21isp/Makefile
==============================================================================
--- head/devel/lpc21isp/Makefile Thu Nov 30 06:09:27 2017 (r455166)
+++ head/devel/lpc21isp/Makefile Thu Nov 30 06:13:34 2017 (r455167)
@@ -13,6 +13,7 @@ COMMENT= ISP programmer tool for flashing NXP & Analog
LICENSE= LGPL3+
BROKEN_armv6= fails to compile: no member named 'nQuestionMarks' in 'ISP_ENVIRONMENT'
+BROKEN_armv7= fails to compile: no member named 'nQuestionMarks' in 'ISP_ENVIRONMENT'
USES= gmake
Modified: head/devel/obby/Makefile
==============================================================================
--- head/devel/obby/Makefile Thu Nov 30 06:09:27 2017 (r455166)
+++ head/devel/obby/Makefile Thu Nov 30 06:13:34 2017 (r455167)
@@ -16,6 +16,7 @@ LIB_DEPENDS= libsigc-2.0.so:devel/libsigc++20 \
libnet6.so:net/net6
BROKEN_armv6= fails to compile: no member named 'name' in 'serialise::type_name<long long>'
+BROKEN_armv7= fails to compile: no member named 'name' in 'serialise::type_name<long long>'
USES= pathfix pkgconfig libtool compiler:c++11-lang
USE_CXXSTD= c++11
Modified: head/devel/php-uprofiler/Makefile
==============================================================================
--- head/devel/php-uprofiler/Makefile Thu Nov 30 06:09:27 2017 (r455166)
+++ head/devel/php-uprofiler/Makefile Thu Nov 30 06:13:34 2017 (r455167)
@@ -15,6 +15,7 @@ LICENSE_FILE= ${WRKSRC}/../LICENSE
BROKEN_aarch64= Does not build: invokes x86 asm
BROKEN_armv6= Does not build: invokes x86 asm
+BROKEN_armv7= Does not build: invokes x86 asm
BROKEN_mips64= Does not build: invokes x86 asm
BROKEN_powerpc64= Does not build: invokes x86 asm
BROKEN_sparc64= Does not build: invokes x86 asm
Modified: head/devel/py-jcc/Makefile
==============================================================================
--- head/devel/py-jcc/Makefile Thu Nov 30 06:09:27 2017 (r455166)
+++ head/devel/py-jcc/Makefile Thu Nov 30 06:13:34 2017 (r455167)
@@ -15,6 +15,7 @@ LICENSE= APACHE20
LICENSE_FILE= ${WRKSRC}/LICENSE
BROKEN_armv6= fails to link: /nxb-bin/usr/bin/ld: cannot find -ljava
+BROKEN_armv7= fails to link: /nxb-bin/usr/bin/ld: cannot find -ljava
USES= python
USE_PYTHON= distutils autoplist
Modified: head/devel/smv/Makefile
==============================================================================
--- head/devel/smv/Makefile Thu Nov 30 06:09:27 2017 (r455166)
+++ head/devel/smv/Makefile Thu Nov 30 06:13:34 2017 (r455167)
@@ -13,6 +13,7 @@ COMMENT= Symbolic Model Verifier System for checking f
BROKEN_aarch64= fails to build: undefined reference to sbrk
BROKEN_armv6= fails to build: error: non-void function check_bdd should return a value
+BROKEN_armv7= fails to build: error: non-void function check_bdd should return a value
USE_GCC= yes
WRKSRC= ${WRKDIR}/${PORTNAME}
Modified: head/devel/statcvs/Makefile
==============================================================================
--- head/devel/statcvs/Makefile Thu Nov 30 06:09:27 2017 (r455166)
+++ head/devel/statcvs/Makefile Thu Nov 30 06:13:34 2017 (r455167)
@@ -15,6 +15,7 @@ LICENSE= LGPL21+
LICENSE_FILE= ${WRKSRC}/etc/LICENSE
BROKEN_armv6= fails to compile: build.xml: compilation failed
+BROKEN_armv7= fails to compile: build.xml: compilation failed
USES= zip
USE_JAVA= yes
Modified: head/devel/tesla/Makefile
==============================================================================
--- head/devel/tesla/Makefile Thu Nov 30 06:09:27 2017 (r455166)
+++ head/devel/tesla/Makefile Thu Nov 30 06:13:34 2017 (r455167)
@@ -13,6 +13,7 @@ RUN_DEPENDS= clang33:lang/clang33
LIB_DEPENDS= libprotobuf.so:devel/protobuf
BROKEN_armv6= fails to link: cmTC_8106f uses VFP register arguments, testCCompiler.c.o does not
+BROKEN_armv7= fails to link: cmTC_8106f uses VFP register arguments, testCCompiler.c.o does not
SHEBANG_FILES= scripts/highlight-transitions
Modified: head/dns/dnsutl/Makefile
==============================================================================
--- head/dns/dnsutl/Makefile Thu Nov 30 06:09:27 2017 (r455166)
+++ head/dns/dnsutl/Makefile Thu Nov 30 06:13:34 2017 (r455167)
@@ -13,6 +13,7 @@ COMMENT= Programs to make using DNS easier
LIB_DEPENDS= libexplain.so:devel/libexplain
BROKEN_armv6= fails to package: FAILED test of common/srrf.c file
+BROKEN_armv7= fails to package: FAILED test of common/srrf.c file
GNU_CONFIGURE= yes
ALL_TARGET= all sure
Modified: head/dns/powerdns-recursor/Makefile
==============================================================================
--- head/dns/powerdns-recursor/Makefile Thu Nov 30 06:09:27 2017 (r455166)
+++ head/dns/powerdns-recursor/Makefile Thu Nov 30 06:13:34 2017 (r455167)
@@ -18,6 +18,7 @@ BUILD_DEPENDS= ${LOCALBASE}/include/boost/shared_ptr.h
LIB_DEPENDS= libboost_context.so:devel/boost-libs
BROKEN_armv6= fails to compile: use of overloaded operator << is ambiguous
+BROKEN_armv7= fails to compile: use of overloaded operator << is ambiguous
BROKEN_sparc64= fails to compile: json11.cpp: undefined reference to std::__throw_out_of_range_fmt
BROKEN_powerpc64= fails to compile: dnslabeltext.cc: undefined reference to std::__cxx11::basic_string
Modified: head/editors/mp/Makefile
==============================================================================
--- head/editors/mp/Makefile Thu Nov 30 06:09:27 2017 (r455166)
+++ head/editors/mp/Makefile Thu Nov 30 06:13:34 2017 (r455167)
@@ -14,6 +14,7 @@ LICENSE_FILE= ${WRKSRC}/COPYING
BROKEN_aarch64= fails to compile: conflicting types for __wcwidth
BROKEN_armv6= fails to compile: conflicting types for __wcwidth
+BROKEN_armv7= fails to compile: conflicting types for __wcwidth
USES= iconv ncurses
HAS_CONFIGURE= yes
Modified: head/editors/texmacs/Makefile
==============================================================================
--- head/editors/texmacs/Makefile Thu Nov 30 06:09:27 2017 (r455166)
+++ head/editors/texmacs/Makefile Thu Nov 30 06:13:34 2017 (r455167)
@@ -20,6 +20,7 @@ LIB_DEPENDS= libltdl.so:devel/libltdl \
RUN_DEPENDS= fig2dev:print/transfig
BROKEN_armv6= fails to compile: call to min is ambiguous
+BROKEN_armv7= fails to compile: call to min is ambiguous
USES= cpe desktop-file-utils gmake iconv localbase pkgconfig python \
shared-mime-info shebangfix
Modified: head/editors/yui/Makefile
==============================================================================
--- head/editors/yui/Makefile Thu Nov 30 06:09:27 2017 (r455166)
+++ head/editors/yui/Makefile Thu Nov 30 06:13:34 2017 (r455167)
@@ -15,6 +15,7 @@ LICENSE_FILE= ${WRKSRC}/COPYRIGHT
BROKEN_aarch64= fails to compile: cast from pointer to smaller type loses information
BROKEN_armv6= fails to link: undefined reference to HTAnchor_physical
+BROKEN_armv7= fails to link: undefined reference to HTAnchor_physical
BROKEN_mips64= fails to compile: cast from unsigned char* to unsigned int loses precision
BROKEN_sparc64= fails to compile
BROKEN_powerpc64= fails to build: strip: open tyui/y failed: No such file or directory
Modified: head/emulators/adamem/Makefile
==============================================================================
--- head/emulators/adamem/Makefile Thu Nov 30 06:09:27 2017 (r455166)
+++ head/emulators/adamem/Makefile Thu Nov 30 06:13:34 2017 (r455167)
@@ -13,6 +13,7 @@ COMMENT= ADAMEm is a portable Coleco ADAM and ColecoVi
BROKEN_aarch64= fails to build: regparm is not valid on this platform
BROKEN_armv6= fails to build: regparm is not valid on this platform
+BROKEN_armv7= fails to build: regparm is not valid on this platform
NO_WRKSUBDIR= yes
USE_XORG= sm x11 xau xext xfixes xi xrandr
Modified: head/emulators/catapult/Makefile
==============================================================================
--- head/emulators/catapult/Makefile Thu Nov 30 06:09:27 2017 (r455166)
+++ head/emulators/catapult/Makefile Thu Nov 30 06:13:34 2017 (r455167)
@@ -38,6 +38,7 @@ MAKE_JOBS_UNSAFE= yes
BROKEN_aarch64= fails to link: fails to detect libxml2 even though it is installed
BROKEN_armv6= fails to link: fails to detect libxml2 even though it is installed
+BROKEN_armv7= fails to link: fails to detect libxml2 even though it is installed
.include <bsd.port.options.mk>
Modified: head/emulators/dtcyber/Makefile
==============================================================================
--- head/emulators/dtcyber/Makefile Thu Nov 30 06:09:27 2017 (r455166)
+++ head/emulators/dtcyber/Makefile Thu Nov 30 06:13:34 2017 (r455167)
@@ -25,6 +25,7 @@ PLIST_FILES= bin/dtcyber %%EXAMPLESDIR%%/cyber.ini %%E
BROKEN_aarch64= Fails to compile: error: Unable to determine size of basic data types
BROKEN_armv6= Fails to compile: error: Unable to determine size of basic data types
+BROKEN_armv7= Fails to compile: error: Unable to determine size of basic data types
BROKEN_mips64= Fails to compile: error: Unable to determine size of basic data types
do-install:
Modified: head/emulators/gem5/Makefile
==============================================================================
--- head/emulators/gem5/Makefile Thu Nov 30 06:09:27 2017 (r455166)
+++ head/emulators/gem5/Makefile Thu Nov 30 06:13:34 2017 (r455167)
@@ -12,6 +12,7 @@ BUILD_DEPENDS= swig2.0:devel/swig20 \
scons:devel/scons
BROKEN_armv6= fails to link: undefined reference to HDLcd::BUS_OPTIONS_RESETV
+BROKEN_armv7= fails to link: undefined reference to HDLcd::BUS_OPTIONS_RESETV
BROKEN_i386= does not build
BROKEN_mips64= fails to build: claims that gcc version 4.6 or newer required
BROKEN_powerpc64= fails to build: claims that gcc version 4.6 or newer required
Modified: head/emulators/unicorn/Makefile
==============================================================================
--- head/emulators/unicorn/Makefile Thu Nov 30 06:09:27 2017 (r455166)
+++ head/emulators/unicorn/Makefile Thu Nov 30 06:13:34 2017 (r455167)
@@ -13,6 +13,7 @@ LICENSE_FILE= ${WRKSRC}/COPYING
TEST_DEPENDS= cmocka>0:sysutils/cmocka
BROKEN_armv6= fails to compile: 'tcg-target.h' file not found
+BROKEN_armv7= fails to compile: 'tcg-target.h' file not found
BROKEN_mips= fails to compile: 'ICACHE' undeclared (first use in this function)
BROKEN_mips64= fails to compile: 'ICACHE' undeclared (first use in this function)
BROKEN_powerpc64= fails to compile: cc1: unrecognized command line option "-Wno-logical-op-parentheses"
Modified: head/emulators/visualboyadvance-m/Makefile
==============================================================================
--- head/emulators/visualboyadvance-m/Makefile Thu Nov 30 06:09:27 2017 (r455166)
+++ head/emulators/visualboyadvance-m/Makefile Thu Nov 30 06:13:34 2017 (r455167)
@@ -15,6 +15,7 @@ LIB_DEPENDS= libpng.so:graphics/png
BROKEN_aarch64= fails to build: regparm is not valid on this platform
BROKEN_armv6= fails to build: regparm is not valid on this platform
+BROKEN_armv7= fails to build: regparm is not valid on this platform
USE_GITHUB= yes
GH_TAGNAME= VBA-M_Beta_2
Modified: head/ftp/ftpcopy/Makefile
==============================================================================
--- head/ftp/ftpcopy/Makefile Thu Nov 30 06:09:27 2017 (r455166)
+++ head/ftp/ftpcopy/Makefile Thu Nov 30 06:13:34 2017 (r455167)
@@ -11,6 +11,7 @@ COMMENT= Command line ftp tools for listing and mirror
BROKEN_aarch64= fails to build: regparm is not valid on this platform
BROKEN_armv6= fails to build: regparm is not valid on this platform
+BROKEN_armv7= fails to build: regparm is not valid on this platform
USES= perl5
USE_PERL5= build
Modified: head/ftp/wxdfast/Makefile
==============================================================================
--- head/ftp/wxdfast/Makefile Thu Nov 30 06:09:27 2017 (r455166)
+++ head/ftp/wxdfast/Makefile Thu Nov 30 06:13:34 2017 (r455167)
@@ -15,6 +15,7 @@ LICENSE= GPLv2
LICENSE_FILE= ${WRKSRC}/COPYING
BROKEN_armv6= fails to compile: no matching member function for call to 'Read'
+BROKEN_armv7= fails to compile: no matching member function for call to 'Read'
WRKSRC= ${WRKDIR}/${PORTNAME}-${PORTVERSION}
Modified: head/games/0ad/Makefile
==============================================================================
--- head/games/0ad/Makefile Thu Nov 30 06:09:27 2017 (r455166)
+++ head/games/0ad/Makefile Thu Nov 30 06:13:34 2017 (r455167)
@@ -45,6 +45,7 @@ MAKE_ENV+= JOBS=${_MAKE_JOBS}
BROKEN_aarch64= fails to compile: no member named verifyHeapAccessDisassembly
BROKEN_armv6= fails to link: fatal error: conftest: Unknown error: -1
+BROKEN_armv7= fails to link: fatal error: conftest: Unknown error: -1
BROKEN_powerpc64= fails to compile: _psutil_bsd.c: error: 'struct xtcpcb' has no member named 'xt_tp'
PORTDATA= *
Modified: head/games/cataclysm-dda/Makefile
==============================================================================
--- head/games/cataclysm-dda/Makefile Thu Nov 30 06:09:27 2017 (r455166)
+++ head/games/cataclysm-dda/Makefile Thu Nov 30 06:13:34 2017 (r455167)
@@ -15,6 +15,7 @@ LICENSE_FILE= ${WRKSRC}/LICENSE.txt
BROKEN_aarch64= fails to compile: comparison of integers of different signs: wchar_t and const int
BROKEN_armv6= fails to compile: comparison of integers of different signs: wchar_t and const int
+BROKEN_armv7= fails to compile: comparison of integers of different signs: wchar_t and const int
BROKEN_powerpc64= fails to compile: overmap.cpp: 'pow' is not a member of 'std'
USES= alias compiler:c++11-lib gmake shebangfix
Modified: head/games/crafty-tablebase-no-pawn/Makefile
==============================================================================
--- head/games/crafty-tablebase-no-pawn/Makefile Thu Nov 30 06:09:27 2017 (r455166)
+++ head/games/crafty-tablebase-no-pawn/Makefile Thu Nov 30 06:13:34 2017 (r455167)
@@ -51,6 +51,7 @@ NO_BUILD= yes
BROKEN_aarch64= Fails to install: runaway process
BROKEN_armv6= Fails to install: runaway process
+BROKEN_armv7= Fails to install: runaway process
BROKEN_mips64= Fails to install: runaway process
BROKEN_powerpc64= Fails to install: runaway process
Modified: head/games/dhewm3/Makefile
==============================================================================
--- head/games/dhewm3/Makefile Thu Nov 30 06:09:27 2017 (r455166)
+++ head/games/dhewm3/Makefile Thu Nov 30 06:13:34 2017 (r455167)
@@ -16,6 +16,7 @@ LIB_DEPENDS= libcurl.so:ftp/curl \
libvorbis.so:audio/libvorbis
BROKEN_armv6= dumps core: Assertion failed: (!NodePtr->isKnownSentinel()), function operator*, file ilist_iterator.h
+BROKEN_armv7= dumps core: Assertion failed: (!NodePtr->isKnownSentinel()), function operator*, file ilist_iterator.h
USE_GITHUB= yes
GH_ACCOUNT= dhewm
Modified: head/games/exult/Makefile
==============================================================================
--- head/games/exult/Makefile Thu Nov 30 06:09:27 2017 (r455166)
+++ head/games/exult/Makefile Thu Nov 30 06:13:34 2017 (r455167)
@@ -16,6 +16,7 @@ LIB_DEPENDS= libvorbis.so:audio/libvorbis \
libpng.so:graphics/png
BROKEN_armv6= fails to compile: constant expression evaluates to -1 which cannot be narrowed to type char
+BROKEN_armv7= fails to compile: constant expression evaluates to -1 which cannot be narrowed to type char
BROKEN_aarch64= fails to compile: constant expression evaluates to -1 which cannot be narrowed to type char
USE_GITHUB= yes
Modified: head/games/fkiss/Makefile
==============================================================================
--- head/games/fkiss/Makefile Thu Nov 30 06:09:27 2017 (r455166)
+++ head/games/fkiss/Makefile Thu Nov 30 06:13:34 2017 (r455167)
@@ -20,6 +20,7 @@ RUN_DEPENDS= lha:archivers/lha
BROKEN_aarch64= fails to compile: passing char * to parameter of incompatible type __builtin_va_list
BROKEN_armv6= fails to compile: passing char * to parameter of incompatible type __builtin_va_list
+BROKEN_armv7= fails to compile: passing char * to parameter of incompatible type __builtin_va_list
EXTRA_PATCHES= ${WRKDIR}/${PORTNAME}-${PORTVERSION}.diff
Modified: head/games/flyhard/Makefile
==============================================================================
--- head/games/flyhard/Makefile Thu Nov 30 06:09:27 2017 (r455166)
+++ head/games/flyhard/Makefile Thu Nov 30 06:13:34 2017 (r455167)
@@ -18,6 +18,7 @@ LIB_DEPENDS= libpng.so:graphics/png
BUILD_DEPENDS= ${LOCALBASE}/include/boost/shared_ptr.hpp:devel/boost-libs
BROKEN_armv6= dumps core: Assertion failed: (!NodePtr->isKnownSentinel()), function operator*, file ilist_iterator.h
+BROKEN_armv7= dumps core: Assertion failed: (!NodePtr->isKnownSentinel()), function operator*, file ilist_iterator.h
GNU_CONFIGURE= yes
USES= gmake
Modified: head/games/ivan/Makefile
==============================================================================
--- head/games/ivan/Makefile Thu Nov 30 06:09:27 2017 (r455166)
+++ head/games/ivan/Makefile Thu Nov 30 06:13:34 2017 (r455167)
@@ -14,6 +14,7 @@ LICENSE= GPLv2
LICENSE_FILE= ${WRKSRC}/COPYING
BROKEN_armv6= fails to compile: use of overloaded operator '<<' is ambiguous
+BROKEN_armv7= fails to compile: use of overloaded operator '<<' is ambiguous
USE_SDL= sdl
USES= gmake
Modified: head/games/jinput/Makefile
==============================================================================
--- head/games/jinput/Makefile Thu Nov 30 06:09:27 2017 (r455166)
+++ head/games/jinput/Makefile Thu Nov 30 06:13:34 2017 (r455167)
@@ -13,6 +13,7 @@ BUILD_DEPENDS= ${JAVALIBDIR}/jutils/jutils.jar:games/j
RUN_DEPENDS= ${JAVALIBDIR}/jutils/jutils.jar:games/jutils
BROKEN_armv6= fails to compile: build.xml: compilation failed
+BROKEN_armv7= fails to compile: build.xml: compilation failed
USES= tar:bzip2
USE_JAVA= yes
Modified: head/games/macopix/Makefile
==============================================================================
--- head/games/macopix/Makefile Thu Nov 30 06:09:27 2017 (r455166)
+++ head/games/macopix/Makefile Thu Nov 30 06:13:34 2017 (r455167)
@@ -15,6 +15,7 @@ LICENSE= GPLv2+
LICENSE_FILE= ${WRKSRC}/COPYING
BROKEN_armv6= dumps core: Assertion failed: (!NodePtr->isKnownSentinel()), function operator*, file ilist_iterator.h
+BROKEN_armv7= dumps core: Assertion failed: (!NodePtr->isKnownSentinel()), function operator*, file ilist_iterator.h
LIB_DEPENDS= libpng.so:graphics/png \
libtiff.so:graphics/tiff
Modified: head/games/nazghul/Makefile
==============================================================================
--- head/games/nazghul/Makefile Thu Nov 30 06:09:27 2017 (r455166)
+++ head/games/nazghul/Makefile Thu Nov 30 06:13:34 2017 (r455167)
@@ -16,6 +16,7 @@ LIB_DEPENDS= libpng.so:graphics/png
BROKEN_aarch64= fails to compile: no matching function for call to cmdwin_vpush
BROKEN_armv6= fails to compile: no matching function for call to cmdwin_vpush
+BROKEN_armv7= fails to compile: no matching function for call to cmdwin_vpush
USE_SDL= sdl image mixer
GNU_CONFIGURE= yes
Modified: head/games/netradiant/Makefile
==============================================================================
--- head/games/netradiant/Makefile Thu Nov 30 06:09:27 2017 (r455166)
+++ head/games/netradiant/Makefile Thu Nov 30 06:13:34 2017 (r455167)
@@ -21,6 +21,7 @@ LIB_DEPENDS= libgtkglext-x11-1.0.so:x11-toolkits/gtkgl
BROKEN_aarch64= fails to link: ldd: install/modules/archivepak.so: not a FreeBSD ELF shared object
BROKEN_armv6= fails to build: h2data.armv6: No such file or directory
+BROKEN_armv7= fails to build: h2data.armv7: No such file or directory
USES= gmake jpeg pkgconfig tar:bzip2
USE_GL= gl
Modified: head/games/oolite/Makefile
==============================================================================
--- head/games/oolite/Makefile Thu Nov 30 06:09:27 2017 (r455166)
+++ head/games/oolite/Makefile Thu Nov 30 06:13:34 2017 (r455167)
@@ -54,6 +54,7 @@ OPTIONS_DEFINE= DOCS
BROKEN_aarch64= fails to configure: error: These compiler flags are invalid: -O
BROKEN_armv6= fails to compile: your compiler does not follow the C++ specification for temporary object destruction order
+BROKEN_armv7= fails to compile: your compiler does not follow the C++ specification for temporary object destruction order
.include <bsd.port.pre.mk>
Modified: head/games/residualvm/Makefile
==============================================================================
--- head/games/residualvm/Makefile Thu Nov 30 06:09:27 2017 (r455166)
+++ head/games/residualvm/Makefile Thu Nov 30 06:13:34 2017 (r455167)
@@ -10,6 +10,7 @@ MAINTAINER= yerenkow at gmail.com
COMMENT= ResidualVM allows you to indulge with classic games like Grim Fandango
BROKEN_armv6= fails to link: ld: libgrim.a has EABI version 0, but target residualvm has EABI version 5
+BROKEN_armv7= fails to link: ld: libgrim.a has EABI version 0, but target residualvm has EABI version 5
USE_GITHUB= yes
Modified: head/games/stockfish/Makefile
==============================================================================
--- head/games/stockfish/Makefile Thu Nov 30 06:09:27 2017 (r455166)
+++ head/games/stockfish/Makefile Thu Nov 30 06:13:34 2017 (r455167)
@@ -16,6 +16,7 @@ LICENSE= GPLv3
NOT_FOR_ARCHS= sparc64
BROKEN_aarch64= Fails to build: cannot detect architecture
BROKEN_armv6= Fails to configure: config-sanity: Error 1
+BROKEN_armv7= Fails to configure: config-sanity: Error 1
BROKEN_mips64= Fails to build: cannot detect architecture
USES= compiler gmake zip
Modified: head/games/trigger-rally/Makefile
==============================================================================
--- head/games/trigger-rally/Makefile Thu Nov 30 06:09:27 2017 (r455166)
+++ head/games/trigger-rally/Makefile Thu Nov 30 06:13:34 2017 (r455167)
@@ -17,6 +17,7 @@ LIB_DEPENDS+= libalut.so:audio/freealut
BROKEN_aarch64= fails to compile: error: the clang compiler does not support -march=native
BROKEN_armv6= fails to compile: error: the clang compiler does not support -march=native
+BROKEN_armv7= fails to compile: error: the clang compiler does not support -march=native
BROKEN_powerpc64= fails to compile: error: the clang compiler does not support -march=native
WRKSRC_SUBDIR= src
Modified: head/german/hunspell/Makefile
==============================================================================
--- head/german/hunspell/Makefile Thu Nov 30 06:09:27 2017 (r455166)
+++ head/german/hunspell/Makefile Thu Nov 30 06:13:34 2017 (r455167)
@@ -19,6 +19,7 @@ BUILD_DEPENDS= aspell:textproc/aspell \
hunspell:textproc/hunspell
BROKEN_armv6= fails to install: hunspell-capmain-plus_de_DE.tmp: Error 1
+BROKEN_armv7= fails to install: hunspell-capmain-plus_de_DE.tmp: Error 1
USES= gmake perl5 shebangfix tar:bzip2
ALL_TARGET= hunspell-all
Modified: head/graphics/aseprite/Makefile
==============================================================================
--- head/graphics/aseprite/Makefile Thu Nov 30 06:09:27 2017 (r455166)
+++ head/graphics/aseprite/Makefile Thu Nov 30 06:13:34 2017 (r455167)
@@ -26,6 +26,7 @@ LIB_DEPENDS= libfreetype.so:print/freetype2 \
BROKEN_aarch64= fails to compile: undefined reference to __va_copy
BROKEN_armv6= fails to compile: undefined reference to __va_copy
+BROKEN_armv7= fails to compile: undefined reference to __va_copy
BROKEN_powerpc64= fails to compile: arena.h: Failed assertion: "arena_mapbits_allocated_get(chunk, pageind) != 0"
BROKEN_sparc64= fails to compile: vsnprintf is not a member of std
Modified: head/graphics/code-eli/Makefile
==============================================================================
--- head/graphics/code-eli/Makefile Thu Nov 30 06:09:27 2017 (r455166)
+++ head/graphics/code-eli/Makefile Thu Nov 30 06:13:34 2017 (r455167)
@@ -36,6 +36,7 @@ DOXYGEN_ALL_TARGET= doc
DOXYGEN_PORTDOCS= html latex
BROKEN_armv6= fails to compile: undefined reference to cbrtl
+BROKEN_armv7= fails to compile: undefined reference to cbrtl
BROKEN_powerpc64= fails to compile: there are no arguments to 'printf' that depend on a template parameter
post-patch-EXAMPLES-off:
Modified: head/graphics/exact-image/Makefile
==============================================================================
--- head/graphics/exact-image/Makefile Thu Nov 30 06:09:27 2017 (r455166)
+++ head/graphics/exact-image/Makefile Thu Nov 30 06:13:34 2017 (r455167)
@@ -24,6 +24,7 @@ LIB_DEPENDS= libagg.so:graphics/agg \
libexpat.so:textproc/expat2
BROKEN_armv6= fails to configure: C++ compiler is not installed or does not work correctly
+BROKEN_armv7= fails to configure: C++ compiler is not installed or does not work correctly
#hack to get custom exactcode configure script to enable tiff support with
#broken headers on c++ in base system:
Modified: head/graphics/exrtools/Makefile
==============================================================================
--- head/graphics/exrtools/Makefile Thu Nov 30 06:09:27 2017 (r455166)
+++ head/graphics/exrtools/Makefile Thu Nov 30 06:13:34 2017 (r455167)
@@ -18,6 +18,7 @@ LIB_DEPENDS= libImath-2_2.so:graphics/ilmbase \
libIlmImf.so:graphics/OpenEXR
BROKEN_armv6= fails to configure: checking for /nxb-bin/usr/bin/cc... no
+BROKEN_armv7= fails to configure: checking for /nxb-bin/usr/bin/cc... no
GNU_CONFIGURE= yes
USES= gmake jpeg pkgconfig
Modified: head/graphics/hiptext/Makefile
==============================================================================
--- head/graphics/hiptext/Makefile Thu Nov 30 06:09:27 2017 (r455166)
+++ head/graphics/hiptext/Makefile Thu Nov 30 06:13:34 2017 (r455167)
@@ -20,6 +20,7 @@ RUN_DEPENDS= ${LOCALBASE}/share/fonts/dejavu/DejaVuSan
BROKEN_aarch64= fails to compile: error: the clang compiler does not support -march=native
BROKEN_armv6= fails to compile: error: the clang compiler does not support -march=native
+BROKEN_armv7= fails to compile: error: the clang compiler does not support -march=native
USE_GITHUB= yes
GH_ACCOUNT= jart
Modified: head/graphics/lightzone/Makefile
==============================================================================
--- head/graphics/lightzone/Makefile Thu Nov 30 06:09:27 2017 (r455166)
+++ head/graphics/lightzone/Makefile Thu Nov 30 06:13:34 2017 (r455167)
@@ -23,6 +23,7 @@ LIB_DEPENDS= liblcms2.so:graphics/lcms2 \
RUN_DEPENDS= jhindexer:java/javahelp
BROKEN_armv6= fails to compile: build.xml: exec returned: 1
+BROKEN_armv7= fails to compile: build.xml: exec returned: 1
USE_GITHUB= yes
GH_ACCOUNT= ktgw0316
Modified: head/graphics/opencolorio/Makefile
==============================================================================
--- head/graphics/opencolorio/Makefile Thu Nov 30 06:09:27 2017 (r455166)
+++ head/graphics/opencolorio/Makefile Thu Nov 30 06:13:34 2017 (r455167)
@@ -37,6 +37,7 @@ SHEBANG_FILES= share/sphinx/ExtractRstFromSourceCPP.py
BROKEN_aarch64= Does not compile: error: use of undeclared identifier __builtin_ia32_emms
BROKEN_armv6= Does not compile: error: use of undeclared identifier __builtin_ia32_emms
+BROKEN_armv7= Does not compile: error: use of undeclared identifier __builtin_ia32_emms
BROKEN_mips64= Does not compile: error: unrecognized command line option -msse2
BROKEN_powerpc64= Does not compile: error: unrecognized command line option -msse2
BROKEN_sparc64= Does not compile: error: unrecognized command line option -msse2
Modified: head/graphics/pencil/Makefile
==============================================================================
--- head/graphics/pencil/Makefile Thu Nov 30 06:09:27 2017 (r455166)
+++ head/graphics/pencil/Makefile Thu Nov 30 06:13:34 2017 (r455167)
@@ -17,6 +17,7 @@ LIB_DEPENDS= libming.so:graphics/ming \
libpng.so:graphics/png
BROKEN_armv6= fails to compile: no matching function for call to 'qMax'
+BROKEN_armv7= fails to compile: no matching function for call to 'qMax'
USES= qmake zip
USE_QT4= gui opengl xml moc_build rcc_build
Modified: head/graphics/picpuz/Makefile
==============================================================================
--- head/graphics/picpuz/Makefile Thu Nov 30 06:09:27 2017 (r455166)
+++ head/graphics/picpuz/Makefile Thu Nov 30 06:13:34 2017 (r455167)
@@ -12,6 +12,7 @@ MAINTAINER= devel at stasyan.com
COMMENT= Jigsaw puzzle program
BROKEN_armv6= fails to compile: use of undeclared identifier __NR_SYSCALL_BASE
+BROKEN_armv7= fails to compile: use of undeclared identifier __NR_SYSCALL_BASE
USES= dos2unix gmake pkgconfig
DOS2UNIX_GLOB= *.h
Modified: head/graphics/pixie/Makefile
==============================================================================
--- head/graphics/pixie/Makefile Thu Nov 30 06:09:27 2017 (r455166)
+++ head/graphics/pixie/Makefile Thu Nov 30 06:13:34 2017 (r455167)
@@ -20,6 +20,7 @@ LIB_DEPENDS= libIlmImf.so:graphics/OpenEXR \
BROKEN_aarch64= fails to compile: use of undeclared identifier CRenderer
BROKEN_armv6= fails to compile: use of undeclared identifier CRenderer
+BROKEN_armv7= fails to compile: use of undeclared identifier CRenderer
BROKEN_sparc64= fails to compile
USE_GL= glu
Modified: head/graphics/s10sh/Makefile
==============================================================================
--- head/graphics/s10sh/Makefile Thu Nov 30 06:09:27 2017 (r455166)
+++ head/graphics/s10sh/Makefile Thu Nov 30 06:13:34 2017 (r455167)
@@ -16,6 +16,7 @@ LICENSE_FILE= ${WRKSRC}/COPYING
BROKEN_aarch64= Fails to build: error: can not find the byte order for this architecture, fix bytesex.h
BROKEN_armv6= Fails to build: error: can not find the byte order for this architecture, fix bytesex.h
+BROKEN_armv7= Fails to build: error: can not find the byte order for this architecture, fix bytesex.h
USES= ncurses readline
Modified: head/irc/srvx/Makefile
==============================================================================
--- head/irc/srvx/Makefile Thu Nov 30 06:09:27 2017 (r455166)
+++ head/irc/srvx/Makefile Thu Nov 30 06:13:34 2017 (r455167)
@@ -13,6 +13,7 @@ LICENSE= GPLv2+
LICENSE_FILE= ${WRKSRC}/COPYING
BROKEN_armv6= fails to configure: Cannot detect format string for time_t
+BROKEN_armv7= fails to configure: Cannot detect format string for time_t
USES= cpe
GNU_CONFIGURE= yes
Modified: head/japanese/mutt-devel/Makefile
==============================================================================
--- head/japanese/mutt-devel/Makefile Thu Nov 30 06:09:27 2017 (r455166)
+++ head/japanese/mutt-devel/Makefile Thu Nov 30 06:13:34 2017 (r455167)
@@ -49,6 +49,7 @@ RUN_DEPENDS= urlview:textproc/urlview \
BROKEN_aarch64= fails to compile: conflicting types for __wcwidth
BROKEN_armv6= fails to compile: conflicting types for __wcwidth
+BROKEN_armv7= fails to compile: conflicting types for __wcwidth
CONFLICTS= ja-mutt-[0-9]* mutt-[0-9]* mutt-devel-[0-9]* mutt-devel-lite-[0-9]* mutt-lite-[0-9]* zh-mutt-devel-[0-9]*
Modified: head/java/berkeley-db/Makefile
==============================================================================
--- head/java/berkeley-db/Makefile Thu Nov 30 06:09:27 2017 (r455166)
+++ head/java/berkeley-db/Makefile Thu Nov 30 06:13:34 2017 (r455167)
@@ -14,6 +14,7 @@ COMMENT= Berkeley DB Java Edition
BUILD_DEPENDS= ${JAVALIBDIR}/junit.jar:java/junit
*** DIFF OUTPUT TRUNCATED AT 1000 LINES ***
More information about the svn-ports-head
mailing list