[package - head-amd64-default][devel/rubygem-eventmachine] Failed for rubygem-eventmachine-1.2.5 in stage
pkg-fallout at FreeBSD.org
pkg-fallout at FreeBSD.org
Thu Jan 18 01:50:43 UTC 2018
You are receiving this mail as a port that you maintain
is failing to build on the FreeBSD package build server.
Please investigate the failure and submit a PR to fix
build.
Maintainer: ruby at FreeBSD.org
Last committer: sunpoet at FreeBSD.org
Ident: $FreeBSD: head/devel/rubygem-eventmachine/Makefile 450295 2017-09-21 17:24:13Z sunpoet $
Log URL: http://beefy12.nyi.freebsd.org/data/head-amd64-default/p459306_s328104/logs/rubygem-eventmachine-1.2.5.log
Build URL: http://beefy12.nyi.freebsd.org/build.html?mastername=head-amd64-default&build=p459306_s328104
Log:
=>> Building devel/rubygem-eventmachine
build started at Thu Jan 18 01:50:14 UTC 2018
port directory: /usr/ports/devel/rubygem-eventmachine
package name: rubygem-eventmachine-1.2.5
building for: FreeBSD head-amd64-default-job-20 12.0-CURRENT FreeBSD 12.0-CURRENT 1200056 amd64
maintained by: ruby at FreeBSD.org
Makefile ident: $FreeBSD: head/devel/rubygem-eventmachine/Makefile 450295 2017-09-21 17:24:13Z sunpoet $
Poudriere version: 3.2.4
Host OSVERSION: 1200054
Jail OSVERSION: 1200056
Job Id: 20
!!! Jail is newer than host. (Jail: 1200056, Host: 1200054) !!!
!!! This is not supported. !!!
!!! Host kernel must be same or newer than jail. !!!
!!! Expect build failures. !!!
---Begin Environment---
SHELL=/bin/csh
OSVERSION=1200056
UNAME_v=FreeBSD 12.0-CURRENT 1200056
UNAME_r=12.0-CURRENT
BLOCKSIZE=K
MAIL=/var/mail/root
STATUS=1
SAVED_TERM=
MASTERMNT=/usr/local/poudriere/data/.m/head-amd64-default/ref
PATH=/sbin:/bin:/usr/sbin:/usr/bin:/usr/local/sbin:/usr/local/bin:/root/bin
POUDRIERE_BUILD_TYPE=bulk
OLDPWD=/usr/local/poudriere/data/.m/head-amd64-default/ref/.p
P_PORTS_FEATURES=FLAVORS SELECTED_OPTIONS
PWD=/usr/local/poudriere/data/.m/head-amd64-default/ref/.p/pool
MASTERNAME=head-amd64-default
SCRIPTPREFIX=/usr/local/share/poudriere
USER=root
HOME=/root
P_PYTHON_MAJOR_VER=2
POUDRIERE_VERSION=3.2.4
SCRIPTPATH=/usr/local/share/poudriere/bulk.sh
LIBEXECPREFIX=/usr/local/libexec/poudriere
LOCALBASE=/usr/local
POUDRIEREPATH=/usr/local/bin/poudriere
---End Environment---
---Begin Poudriere Port Flags/Env---
PORT_FLAGS=
PKGENV=
FLAVOR=
DEPENDS_ARGS=
MAKE_ARGS=
---End Poudriere Port Flags/Env---
---Begin OPTIONS List---
---End OPTIONS List---
--MAINTAINER--
ruby at FreeBSD.org
--End MAINTAINER--
--CONFIGURE_ARGS--
--End CONFIGURE_ARGS--
--CONFIGURE_ENV--
XDG_DATA_HOME=/wrkdirs/usr/ports/devel/rubygem-eventmachine/work XDG_CONFIG_HOME=/wrkdirs/usr/ports/devel/rubygem-eventmachine/work HOME=/wrkdirs/usr/ports/devel/rubygem-eventmachine/work TMPDIR="/tmp" PATH=/wrkdirs/usr/ports/devel/rubygem-eventmachine/work/.bin:/sbin:/bin:/usr/sbin:/usr/bin:/usr/local/sbin:/usr/local/bin:/root/bin SHELL=/bin/sh CONFIG_SHELL=/bin/sh LANG=en_US.UTF-8 LC_ALL=en_US.UTF-8
--End CONFIGURE_ENV--
--MAKE_ENV--
OPENSSLBASE=/usr OPENSSLDIR=/etc/ssl OPENSSLINC=/usr/include OPENSSLLIB=/usr/lib XDG_DATA_HOME=/wrkdirs/usr/ports/devel/rubygem-eventmachine/work XDG_CONFIG_HOME=/wrkdirs/usr/ports/devel/rubygem-eventmachine/work HOME=/wrkdirs/usr/ports/devel/rubygem-eventmachine/work TMPDIR="/tmp" PATH=/wrkdirs/usr/ports/devel/rubygem-eventmachine/work/.bin:/sbin:/bin:/usr/sbin:/usr/bin:/usr/local/sbin:/usr/local/bin:/root/bin NO_PIE=yes MK_DEBUG_FILES=no MK_KERNEL_SYMBOLS=no SHELL=/bin/sh NO_LINT=YES LANG=en_US.UTF-8 LC_ALL=en_US.UTF-8 PREFIX=/usr/local LOCALBASE=/usr/local LIBDIR="/usr/lib" CC="cc" CFLAGS="-O2 -pipe -fstack-protector -fno-strict-aliasing" CPP="cpp" CPPFLAGS="" LDFLAGS=" -fstack-protector" LIBS="" CXX="c++" CXXFLAGS="-O2 -pipe -fstack-protector -fno-strict-aliasing " MANPREFIX="/usr/local" BSD_INSTALL_PROGRAM="install -s -m 555" BSD_INSTALL_LIB="install -s -m 0644" BSD_INSTALL_SCRIPT="install -m 555" BSD_INSTALL_DATA="install -m 0644" BSD_INSTALL_MAN="install -m
444"
--End MAKE_ENV--
--PLIST_SUB--
PORTDOCS="" PORTEXAMPLES="" RUBY_LIBDIR="lib/ruby/2.4" RUBY_ARCHLIBDIR="lib/ruby/2.4/amd64-freebsd12" RUBY_SITELIBDIR="lib/ruby/site_ruby/2.4" RUBY_SITEARCHLIBDIR="lib/ruby/site_ruby/2.4/amd64-freebsd12" RUBY_VENDORLIBDIR="lib/ruby/vendor_ruby/2.4" RUBY_VENDORARCHLIBDIR="lib/ruby/vendor_ruby/2.4/amd64-freebsd12" RUBY_MODDOCDIR="share/doc/ruby24/eventmachine" RUBY_MODEXAMPLESDIR="share/examples/ruby24/eventmachine" RUBY_DOCDIR="share/doc/ruby24" RUBY_EXAMPLESDIR="share/examples/ruby24" RUBY_RIDIR="share/ri/2.4/system" RUBY_SITERIDIR="share/ri/2.4/site" RUBY_VERSION="2.4.3" RUBY_VER="2.4" RUBY_SHLIBVER="24" RUBY_ARCH="amd64-freebsd12" RUBY_SUFFIX="24" RUBY_NAME="ruby24" RUBY_DEFAULT_SUFFIX="24" RUBY22="@comment " RUBY23="@comment " RUBY24="" RUBY25="@comment " PORTVERSION="1.2.5" REV="" GEMS_BASE_DIR="lib/ruby/gems/2.4" GEMS_DIR="lib/ruby/gems/2.4/gems" DOC_DIR="lib/ruby/gems/2.4/doc" CACHE_DIR="lib/ruby/gems/2.4/cache" SPEC_DIR="lib/ruby/gems/2.4/specifications" EXT_
DIR="lib/ruby/gems/2.4/extensions" PORT="eventmachine-1.2.5" GEM_NAME="eventmachine-1.2.5" GEM_LIB_DIR="lib/ruby/gems/2.4/gems/eventmachine-1.2.5" GEM_DOC_DIR="lib/ruby/gems/2.4/doc/eventmachine-1.2.5" GEM_SPEC="lib/ruby/gems/2.4/specifications/eventmachine-1.2.5.gemspec" GEM_CACHE="lib/ruby/gems/2.4/cache/eventmachine-1.2.5.gem" EXTRACT_SUFX=".gem" OSREL=12.0 PREFIX=%D LOCALBASE=/usr/local RESETPREFIX=/usr/local LIB32DIR=lib DOCSDIR="share/doc/eventmachine" EXAMPLESDIR="share/examples/eventmachine" DATADIR="share/eventmachine" WWWDIR="www/eventmachine" ETCDIR="etc/eventmachine"
--End PLIST_SUB--
--SUB_LIST--
PREFIX=/usr/local LOCALBASE=/usr/local DATADIR=/usr/local/share/eventmachine DOCSDIR=/usr/local/share/doc/eventmachine EXAMPLESDIR=/usr/local/share/examples/eventmachine WWWDIR=/usr/local/www/eventmachine ETCDIR=/usr/local/etc/eventmachine
--End SUB_LIST--
---Begin make.conf---
USE_PACKAGE_DEPENDS=yes
BATCH=yes
WRKDIRPREFIX=/wrkdirs
PORTSDIR=/usr/ports
PACKAGES=/packages
DISTDIR=/distfiles
PACKAGE_BUILDING=yes
PACKAGE_BUILDING_FLAVORS=yes
#### /usr/local/etc/poudriere.d/make.conf ####
# XXX: We really need this but cannot use it while 'make checksum' does not
# try the next mirror on checksum failure. It currently retries the same
# failed mirror and then fails rather then trying another. It *does*
# try the next if the size is mismatched though.
#MASTER_SITE_FREEBSD=yes
# Build ALLOW_MAKE_JOBS_PACKAGES with 2 jobs
MAKE_JOBS_NUMBER=2
#### /usr/ports/Mk/Scripts/ports_env.sh ####
ARCH=amd64
CONFIGURE_MAX_CMD_LEN=262144
HAVE_COMPAT_IA32_KERN=YES
OPSYS=FreeBSD
OSREL=12.0
OSVERSION=1200056
PYTHONBASE=/usr/local
UID=0
_OSRELEASE=12.0-CURRENT
#### Misc Poudriere ####
GID=0
DISABLE_MAKE_JOBS=poudriere
---End make.conf---
--Resource limits--
cpu time (seconds, -t) unlimited
file size (512-blocks, -f) unlimited
data seg size (kbytes, -d) 33554432
stack size (kbytes, -s) 524288
core file size (512-blocks, -c) unlimited
max memory size (kbytes, -m) unlimited
locked memory (kbytes, -l) unlimited
max user processes (-u) 89999
open files (-n) 1024
virtual mem size (kbytes, -v) unlimited
swap limit (kbytes, -w) unlimited
socket buffer size (bytes, -b) unlimited
pseudo-terminals (-p) unlimited
kqueues (-k) unlimited
umtx shared locks (-o) unlimited
--End resource limits--
=======================<phase: check-sanity >============================
===> License GPLv2 RUBY accepted by the user
===========================================================================
=======================<phase: pkg-depends >============================
===> rubygem-eventmachine-1.2.5 depends on file: /usr/local/sbin/pkg - not found
===> Installing existing package /packages/All/pkg-1.10.4.txz
[head-amd64-default-job-20] Installing pkg-1.10.4...
[head-amd64-default-job-20] Extracting pkg-1.10.4: .......... done
===> rubygem-eventmachine-1.2.5 depends on file: /usr/local/sbin/pkg - found
===> Returning to build of rubygem-eventmachine-1.2.5
===========================================================================
=======================<phase: fetch-depends >============================
===========================================================================
=======================<phase: fetch >============================
===> License GPLv2 RUBY accepted by the user
===> Fetching all distfiles required by rubygem-eventmachine-1.2.5 for building
===========================================================================
=======================<phase: checksum >============================
===> License GPLv2 RUBY accepted by the user
===> Fetching all distfiles required by rubygem-eventmachine-1.2.5 for building
=> SHA256 Checksum OK for rubygem/eventmachine-1.2.5.gem.
===========================================================================
=======================<phase: extract-depends>============================
===> rubygem-eventmachine-1.2.5 depends on file: /usr/local/bin/ruby24 - not found
===> Installing existing package /packages/All/ruby-2.4.3,1.txz
[head-amd64-default-job-20] Installing ruby-2.4.3,1...
[head-amd64-default-job-20] `-- Installing libedit-3.1.20170329_2,1...
[head-amd64-default-job-20] `-- Extracting libedit-3.1.20170329_2,1: .......... done
[head-amd64-default-job-20] `-- Installing libffi-3.2.1_2...
[head-amd64-default-job-20] | `-- Installing indexinfo-0.3.1...
[head-amd64-default-job-20] | `-- Extracting indexinfo-0.3.1: .... done
[head-amd64-default-job-20] `-- Extracting libffi-3.2.1_2: .......... done
[head-amd64-default-job-20] `-- Installing libunwind-20170113_1...
[head-amd64-default-job-20] `-- Extracting libunwind-20170113_1: .......... done
[head-amd64-default-job-20] `-- Installing libyaml-0.1.6_2...
[head-amd64-default-job-20] `-- Extracting libyaml-0.1.6_2: ......... done
[head-amd64-default-job-20] Extracting ruby-2.4.3,1: .......... done
Message from ruby-2.4.3,1:
====
Some of the standard commands are provided as separate ports for ease
of upgrading:
devel/ruby-gems: gem - RubyGems package manager
devel/rubygem-rake: rake - Ruby Make
And some of the standard libraries are provided as separate ports
since they require extra dependencies:
databases/ruby-gdbm: GDBM module
Install them as occasion demands.
====
===> rubygem-eventmachine-1.2.5 depends on file: /usr/local/bin/ruby24 - found
===> Returning to build of rubygem-eventmachine-1.2.5
===> rubygem-eventmachine-1.2.5 depends on file: /usr/local/bin/gem24 - not found
===> Installing existing package /packages/All/ruby24-gems-2.7.4.txz
[head-amd64-default-job-20] Installing ruby24-gems-2.7.4...
[head-amd64-default-job-20] Extracting ruby24-gems-2.7.4: .......... done
===> rubygem-eventmachine-1.2.5 depends on file: /usr/local/bin/gem24 - found
===> Returning to build of rubygem-eventmachine-1.2.5
===========================================================================
=======================<phase: extract >============================
===> License GPLv2 RUBY accepted by the user
===> Fetching all distfiles required by rubygem-eventmachine-1.2.5 for building
===> Extracting for rubygem-eventmachine-1.2.5
=> SHA256 Checksum OK for rubygem/eventmachine-1.2.5.gem.
<snip>
/usr/include/c++/v1/system_error:492:1: note: candidate function not viable: no known conversion from '__bind<int &, sockaddr *, unsigned long &>' to 'const std::__1::error_condition' for 1st argument
operator<(const error_condition& __x, const error_condition& __y) _NOEXCEPT
^
/usr/include/c++/v1/system_error:569:1: note: candidate function not viable: no known conversion from '__bind<int &, sockaddr *, unsigned long &>' to 'const std::__1::error_code' for 1st argument
operator<(const error_code& __x, const error_code& __y) _NOEXCEPT
^
/usr/include/c++/v1/utility:572:1: note: candidate template ignored: could not match 'pair' against '__bind'
operator< (const pair<_T1,_T2>& __x, const pair<_T1,_T2>& __y)
^
/usr/include/c++/v1/iterator:702:1: note: candidate template ignored: could not match 'reverse_iterator' against '__bind'
operator<(const reverse_iterator<_Iter1>& __x, const reverse_iterator<_Iter2>& __y)
^
/usr/include/c++/v1/iterator:1143:1: note: candidate template ignored: could not match 'move_iterator' against '__bind'
operator<(const move_iterator<_Iter1>& __x, const move_iterator<_Iter2>& __y)
^
/usr/include/c++/v1/iterator:1512:1: note: candidate template ignored: could not match '__wrap_iter' against '__bind'
operator<(const __wrap_iter<_Iter1>& __x, const __wrap_iter<_Iter2>& __y) _NOEXCEPT_DEBUG
^
/usr/include/c++/v1/tuple:1187:1: note: candidate template ignored: could not match 'tuple' against '__bind'
operator<(const tuple<_Tp...>& __x, const tuple<_Up...>& __y)
^
/usr/include/c++/v1/memory:2920:1: note: candidate template ignored: could not match 'unique_ptr' against '__bind'
operator< (const unique_ptr<_T1, _D1>& __x, const unique_ptr<_T2, _D2>& __y)
^
/usr/include/c++/v1/memory:2978:1: note: candidate template ignored: could not match 'unique_ptr' against '__bind'
operator<(const unique_ptr<_T1, _D1>& __x, nullptr_t)
^
/usr/include/c++/v1/memory:2987:1: note: candidate template ignored: could not match 'unique_ptr<type-parameter-0-0, type-parameter-0-1>' against 'int'
operator<(nullptr_t, const unique_ptr<_T1, _D1>& __x)
^
/usr/include/c++/v1/memory:4758:1: note: candidate template ignored: could not match 'shared_ptr' against '__bind'
operator<(const shared_ptr<_Tp>& __x, const shared_ptr<_Up>& __y) _NOEXCEPT
^
/usr/include/c++/v1/memory:4823:1: note: candidate template ignored: could not match 'shared_ptr' against '__bind'
operator<(const shared_ptr<_Tp>& __x, nullptr_t) _NOEXCEPT
^
/usr/include/c++/v1/memory:4831:1: note: candidate template ignored: could not match 'shared_ptr<type-parameter-0-0>' against 'int'
operator<(nullptr_t, const shared_ptr<_Tp>& __x) _NOEXCEPT
^
/usr/include/c++/v1/string_view:671:6: note: candidate template ignored: could not match 'basic_string_view' against '__bind'
bool operator<(basic_string_view<_CharT, _Traits> __lhs, basic_string_view<_CharT, _Traits> __rhs) _NOEXCEPT
^
/usr/include/c++/v1/string_view:678:6: note: candidate template ignored: could not match 'basic_string_view' against '__bind'
bool operator<(basic_string_view<_CharT, _Traits> __lhs,
^
/usr/include/c++/v1/string_view:686:6: note: candidate template ignored: could not match 'basic_string_view<type-parameter-0-0, type-parameter-0-1>' against 'int'
bool operator<(typename common_type<basic_string_view<_CharT, _Traits> >::type __lhs,
^
/usr/include/c++/v1/string:3650:1: note: candidate template ignored: could not match 'basic_string' against '__bind'
operator< (const basic_string<_CharT, _Traits, _Allocator>& __lhs,
^
/usr/include/c++/v1/string:3659:1: note: candidate template ignored: could not match 'basic_string' against '__bind'
operator< (const basic_string<_CharT, _Traits, _Allocator>& __lhs,
^
/usr/include/c++/v1/string:3668:1: note: candidate template ignored: could not match 'const _CharT *' against '__bind<int &, sockaddr *, unsigned long &>'
operator< (const _CharT* __lhs,
^
/usr/include/c++/v1/map:1407:1: note: candidate template ignored: could not match 'map' against '__bind'
operator< (const map<_Key, _Tp, _Compare, _Allocator>& __x,
^
/usr/include/c++/v1/map:1872:1: note: candidate template ignored: could not match 'multimap' against '__bind'
operator< (const multimap<_Key, _Tp, _Compare, _Allocator>& __x,
^
/usr/include/c++/v1/set:754:1: note: candidate template ignored: could not match 'set' against '__bind'
operator< (const set<_Key, _Compare, _Allocator>& __x,
^
/usr/include/c++/v1/set:1164:1: note: candidate template ignored: could not match 'multiset' against '__bind'
operator< (const multiset<_Key, _Compare, _Allocator>& __x,
^
/usr/include/c++/v1/vector:3326:1: note: candidate template ignored: could not match 'vector' against '__bind'
operator< (const vector<_Tp, _Allocator>& __x, const vector<_Tp, _Allocator>& __y)
^
/usr/include/c++/v1/deque:2868:1: note: candidate template ignored: could not match 'deque' against '__bind'
operator< (const deque<_Tp, _Allocator>& __x, const deque<_Tp, _Allocator>& __y)
^
em.cpp:1623:6: error: value of type '__bind<int &, sockaddr *, unsigned long &>' is not contextually convertible to 'bool'
if (bind (sd_accept, (struct sockaddr *)&bind_here, bind_here_len)) {
^~~~~~~~~~~~~~~~~~~~~~~~~~~~~~~~~~~~~~~~~~~~~~~~~~~~~~~~~~~~~~
em.cpp:1670:62: error: invalid operands to binary expression ('__bind<int &, sockaddr *, unsigned long &>' and 'int')
if (bind (sd, (struct sockaddr *)&bind_here, bind_here_len) != 0)
~~~~~~~~~~~~~~~~~~~~~~~~~~~~~~~~~~~~~~~~~~~~~~~~~~~~~~~ ^ ~
/usr/include/c++/v1/system_error:606:1: note: candidate function not viable: no known conversion from '__bind<int &, sockaddr *, unsigned long &>' to 'const std::__1::error_code' for 1st argument
operator!=(const error_code& __x, const error_code& __y) _NOEXCEPT
^
/usr/include/c++/v1/system_error:611:1: note: candidate function not viable: no known conversion from '__bind<int &, sockaddr *, unsigned long &>' to 'const std::__1::error_code' for 1st argument
operator!=(const error_code& __x, const error_condition& __y) _NOEXCEPT
^
/usr/include/c++/v1/system_error:616:1: note: candidate function not viable: no known conversion from '__bind<int &, sockaddr *, unsigned long &>' to 'const std::__1::error_condition' for 1st argument
operator!=(const error_condition& __x, const error_code& __y) _NOEXCEPT
^
/usr/include/c++/v1/system_error:621:1: note: candidate function not viable: no known conversion from '__bind<int &, sockaddr *, unsigned long &>' to 'const std::__1::error_condition' for 1st argument
operator!=(const error_condition& __x, const error_condition& __y) _NOEXCEPT
^
/usr/include/c++/v1/utility:564:1: note: candidate template ignored: could not match 'pair' against '__bind'
operator!=(const pair<_T1,_T2>& __x, const pair<_T1,_T2>& __y)
^
/usr/include/c++/v1/iterator:710:1: note: candidate template ignored: could not match 'reverse_iterator' against '__bind'
operator!=(const reverse_iterator<_Iter1>& __x, const reverse_iterator<_Iter2>& __y)
^
/usr/include/c++/v1/iterator:932:1: note: candidate template ignored: could not match 'istream_iterator' against '__bind'
operator!=(const istream_iterator<_Tp, _CharT, _Traits, _Distance>& __x,
^
/usr/include/c++/v1/iterator:1033:6: note: candidate template ignored: could not match 'istreambuf_iterator' against '__bind'
bool operator!=(const istreambuf_iterator<_CharT,_Traits>& __a,
^
/usr/include/c++/v1/iterator:1151:1: note: candidate template ignored: could not match 'move_iterator' against '__bind'
operator!=(const move_iterator<_Iter1>& __x, const move_iterator<_Iter2>& __y)
^
/usr/include/c++/v1/iterator:1440:5: note: candidate template ignored: could not match '__wrap_iter' against '__bind'
operator!=(const __wrap_iter<_Iter1>&, const __wrap_iter<_Iter2>&) _NOEXCEPT_DEBUG;
^
/usr/include/c++/v1/iterator:1556:1: note: candidate template ignored: could not match '__wrap_iter' against '__bind'
operator!=(const __wrap_iter<_Iter1>& __x, const __wrap_iter<_Iter1>& __y) _NOEXCEPT_DEBUG
^
/usr/include/c++/v1/tuple:1152:1: note: candidate template ignored: could not match 'tuple' against '__bind'
operator!=(const tuple<_Tp...>& __x, const tuple<_Up...>& __y)
^
/usr/include/c++/v1/memory:1965:6: note: candidate template ignored: could not match 'allocator' against '__bind'
bool operator!=(const allocator<_Tp>&, const allocator<_Up>&) _NOEXCEPT {return false;}
^
/usr/include/c++/v1/memory:2915:1: note: candidate template ignored: could not match 'unique_ptr' against '__bind'
operator!=(const unique_ptr<_T1, _D1>& __x, const unique_ptr<_T2, _D2>& __y) {return !(__x == __y);}
^
/usr/include/c++/v1/memory:2962:1: note: candidate template ignored: could not match 'unique_ptr' against '__bind'
operator!=(const unique_ptr<_T1, _D1>& __x, nullptr_t) _NOEXCEPT
^
/usr/include/c++/v1/memory:2970:1: note: candidate template ignored: could not match 'unique_ptr<type-parameter-0-0, type-parameter-0-1>' against 'int'
operator!=(nullptr_t, const unique_ptr<_T1, _D1>& __x) _NOEXCEPT
^
/usr/include/c++/v1/memory:4750:1: note: candidate template ignored: could not match 'shared_ptr' against '__bind'
operator!=(const shared_ptr<_Tp>& __x, const shared_ptr<_Up>& __y) _NOEXCEPT
^
/usr/include/c++/v1/memory:4807:1: note: candidate template ignored: could not match 'shared_ptr' against '__bind'
operator!=(const shared_ptr<_Tp>& __x, nullptr_t) _NOEXCEPT
^
/usr/include/c++/v1/memory:4815:1: note: candidate template ignored: could not match 'shared_ptr<type-parameter-0-0>' against 'int'
operator!=(nullptr_t, const shared_ptr<_Tp>& __x) _NOEXCEPT
^
/usr/include/c++/v1/string_view:640:6: note: candidate template ignored: could not match 'basic_string_view' against '__bind'
bool operator!=(basic_string_view<_CharT, _Traits> __lhs, basic_string_view<_CharT, _Traits> __rhs) _NOEXCEPT
^
/usr/include/c++/v1/string_view:649:6: note: candidate template ignored: could not match 'basic_string_view' against '__bind'
bool operator!=(basic_string_view<_CharT, _Traits> __lhs,
^
/usr/include/c++/v1/string_view:659:6: note: candidate template ignored: could not match 'basic_string_view<type-parameter-0-0, type-parameter-0-1>' against 'int'
bool operator!=(typename common_type<basic_string_view<_CharT, _Traits> >::type __lhs,
^
/usr/include/c++/v1/string:540:6: note: candidate template ignored: could not match 'fpos' against '__bind'
bool operator!=(const fpos<_StateT>& __x, const fpos<_StateT>& __y)
^
/usr/include/c++/v1/string:3621:1: note: candidate template ignored: could not match 'basic_string' against '__bind'
operator!=(const basic_string<_CharT,_Traits,_Allocator>& __lhs,
^
/usr/include/c++/v1/string:3630:1: note: candidate template ignored: could not match 'const _CharT *' against '__bind<int &, sockaddr *, unsigned long &>'
operator!=(const _CharT* __lhs,
^
/usr/include/c++/v1/string:3639:1: note: candidate template ignored: could not match 'basic_string' against '__bind'
operator!=(const basic_string<_CharT, _Traits, _Allocator>& __lhs,
^
/usr/include/c++/v1/functional:1965:1: note: candidate template ignored: could not match 'function' against '__bind'
operator!=(const function<_Rp(_ArgTypes...)>& __f, nullptr_t) _NOEXCEPT {return (bool)__f;}
^
/usr/include/c++/v1/functional:1970:1: note: candidate template ignored: could not match 'function<type-parameter-0-0 (type-parameter-0-1...)>' against 'int'
operator!=(nullptr_t, const function<_Rp(_ArgTypes...)>& __f) _NOEXCEPT {return (bool)__f;}
^
/usr/include/c++/v1/map:1416:1: note: candidate template ignored: could not match 'map' against '__bind'
operator!=(const map<_Key, _Tp, _Compare, _Allocator>& __x,
^
/usr/include/c++/v1/map:1881:1: note: candidate template ignored: could not match 'multimap' against '__bind'
operator!=(const multimap<_Key, _Tp, _Compare, _Allocator>& __x,
^
/usr/include/c++/v1/set:763:1: note: candidate template ignored: could not match 'set' against '__bind'
operator!=(const set<_Key, _Compare, _Allocator>& __x,
^
/usr/include/c++/v1/set:1173:1: note: candidate template ignored: could not match 'multiset' against '__bind'
operator!=(const multiset<_Key, _Compare, _Allocator>& __x,
^
/usr/include/c++/v1/vector:3318:1: note: candidate template ignored: could not match 'vector' against '__bind'
operator!=(const vector<_Tp, _Allocator>& __x, const vector<_Tp, _Allocator>& __y)
^
/usr/include/c++/v1/deque:2860:1: note: candidate template ignored: could not match 'deque' against '__bind'
operator!=(const deque<_Tp, _Allocator>& __x, const deque<_Tp, _Allocator>& __y)
^
em.cpp:1956:6: error: value of type '__bind<int &, sockaddr *, unsigned long>' is not contextually convertible to 'bool'
if (bind (sd_accept, (struct sockaddr*)&s_sun, sizeof(s_sun))) {
^~~~~~~~~~~~~~~~~~~~~~~~~~~~~~~~~~~~~~~~~~~~~~~~~~~~~~~~~
2 warnings and 4 errors generated.
*** Error code 1
Stop.
make[1]: stopped in /wrkdirs/usr/ports/devel/rubygem-eventmachine/work/stage/usr/local/lib/ruby/gems/2.4/gems/eventmachine-1.2.5/ext
make failed, exit code 1
Gem files will remain installed in /wrkdirs/usr/ports/devel/rubygem-eventmachine/work/stage/usr/local/lib/ruby/gems/2.4/gems/eventmachine-1.2.5 for inspection.
Results logged to /wrkdirs/usr/ports/devel/rubygem-eventmachine/work/stage/usr/local/lib/ruby/gems/2.4/extensions/amd64-freebsd-12/2.4/eventmachine-1.2.5/gem_make.out
*** Error code 1
Stop.
make: stopped in /usr/ports/devel/rubygem-eventmachine
More information about the freebsd-ruby
mailing list