dasher-4.10.1_6,2 unknown build error

AN andy at neu.net
Tue May 7 03:01:10 UTC 2013


FreeBSD FBSD10 10.0-CURRENT FreeBSD 10.0-CURRENT #67 r250037: Sun Apr 28 
19:43:52 CDT 2013     root at FBSD10:/usr/obj/usr/src/sys/MYKERNEL  amd64

...

Making all in LanguageModelling
gmake[4]: Entering directory 
`/usr/ports/accessibility/dasher/work/dasher-4.10.1/Src/DasherCore/LanguageModelling'
c++ -DHAVE_CONFIG_H -I. -I../../..   -I/usr/local/include  -O2 -pipe 
-fno-strict-aliasing -MT CTWLanguageModel.o -MD -MP -MF 
.deps/CTWLanguageModel.Tpo -c -o CTWLanguageModel.o CTWLanguageModel.cpp
In file included from CTWLanguageModel.cpp:26:
In file included from ./CTWLanguageModel.h:30:
In file included from ./LanguageModel.h:15:
In file included from ./../DasherComponent.h:4:
./../SettingsStore.h:21:7: error: forward declaration of class cannot have 
a nested name specifier
class Dasher::CEventHandler;
       ^~~~~~~~
./../SettingsStore.h:22:7: error: forward declaration of class cannot have 
a nested name specifier
class Dasher::CParameterNotificationEvent;
       ^~~~~~~~
CTWLanguageModel.cpp:443:2: warning: array index 4 is past the end of the 
array (which contains 4 elements) [-Warray-bounds]
         GenericHeader.szMagic[4] = '\0';
         ^                     ~
./LanguageModel.h:157:5: note: array 'szMagic' declared here
     char szMagic[4];
     ^
1 warning and 2 errors generated.
gmake[4]: *** [CTWLanguageModel.o] Error 1
gmake[4]: Leaving directory 
`/usr/ports/accessibility/dasher/work/dasher-4.10.1/Src/DasherCore/LanguageModelling'
gmake[3]: *** [all-recursive] Error 1
gmake[3]: Leaving directory 
`/usr/ports/accessibility/dasher/work/dasher-4.10.1/Src/DasherCore'
gmake[2]: *** [all-recursive] Error 1
gmake[2]: Leaving directory 
`/usr/ports/accessibility/dasher/work/dasher-4.10.1/Src'
gmake[1]: *** [all-recursive] Error 1
gmake[1]: Leaving directory 
`/usr/ports/accessibility/dasher/work/dasher-4.10.1'
gmake: *** [all] Error 2
*** [do-build] Error code 1

Stop in /usr/ports/accessibility/dasher.
** Command failed [exit code 1]: /usr/bin/script -qa 
/tmp/portupgrade20130506-17698-1up75wk-0 env UPGRADE_TOOL=portupgrade 
UPGRADE_PORT=dasher-4.10.1_6,2 UPGRADE_PORT_VER=4.10.1_6,2 make
** Fix the problem and try again.
--->  Build of accessibility/dasher ended at: Mon, 06 May 2013 21:57:06 
-0500 (consumed 00:00:09)
--->  Reinstallation of accessibility/dasher ended at: Mon, 06 May 2013 
21:57:06 -0500 (consumed 00:00:09)
--->  ** Upgrade tasks 1: 0 done, 0 ignored, 0 skipped and 1 failed
--->  Listing the results (+:done / -:ignored / *:skipped / !:failed)
 	! accessibility/dasher (dasher-4.10.1_6,2)	(unknown build 
error)
--->  Packages processed: 0 done, 0 ignored, 0 skipped and 1 failed




More information about the freebsd-ports mailing list