[Bug 219634] port java/openjdk7 fails to build in poudriere
bugzilla-noreply at freebsd.org
bugzilla-noreply at freebsd.org
Mon May 29 13:13:05 UTC 2017
https://bugs.freebsd.org/bugzilla/show_bug.cgi?id=219634
Bug ID: 219634
Summary: port java/openjdk7 fails to build in poudriere
Product: Ports & Packages
Version: Latest
Hardware: Any
OS: Any
Status: New
Severity: Affects Only Me
Priority: ---
Component: Individual Port(s)
Assignee: glewis at FreeBSD.org
Reporter: transitive at gmail.com
Flags: maintainer-feedback?(glewis at FreeBSD.org)
Assignee: glewis at FreeBSD.org
The port for openjdk-7.131.00,1 fails to build in poudriere for me. Below is an
excerpt of the poudriere build log:
In file included from
/wrkdirs/usr/ports/java/openjdk7/work/openjdk/hotspot/src/share/vm/opto/matcher.cpp:25:
In file included from
/wrkdirs/usr/ports/java/openjdk7/work/openjdk/hotspot/src/share/vm/precompiled/precompiled.hpp:36:
In file included from
/wrkdirs/usr/ports/java/openjdk7/work/openjdk/hotspot/src/share/vm/ci/ciConstant.hpp:29:
In file included from
/wrkdirs/usr/ports/java/openjdk7/work/openjdk/hotspot/src/share/vm/ci/ciNullObject.hpp:30:
In file included from
/wrkdirs/usr/ports/java/openjdk7/work/openjdk/hotspot/src/share/vm/ci/ciUtilities.hpp:28:
In file included from
/wrkdirs/usr/ports/java/openjdk7/work/openjdk/hotspot/src/share/vm/ci/ciEnv.hpp:30:
In file included from
/wrkdirs/usr/ports/java/openjdk7/work/openjdk/hotspot/src/share/vm/classfile/systemDictionary.hpp:29:
In file included from
/wrkdirs/usr/ports/java/openjdk7/work/openjdk/hotspot/src/share/vm/classfile/classLoader.hpp:28:
In file included from
/wrkdirs/usr/ports/java/openjdk7/work/openjdk/hotspot/src/share/vm/classfile/classFileParser.hpp:30:
In file included from
/wrkdirs/usr/ports/java/openjdk7/work/openjdk/hotspot/src/share/vm/oops/oop.inline.hpp:29:
In file included from
/wrkdirs/usr/ports/java/openjdk7/work/openjdk/hotspot/src/share/vm/gc_implementation/shared/markSweep.inline.hpp:30:
/wrkdirs/usr/ports/java/openjdk7/work/openjdk/hotspot/src/share/vm/utilities/stack.inline.hpp:111:10:
warning: implicit conversion changes signedness: 'intptr_t' (aka 'long') to
'size_t' (aka 'unsigned long') [-Wsign-conversion]
return align_size_up(this->_seg_size * sizeof(E), sizeof(E*));
~~~~~~ ^~~~~~~~~~~~~~~~~~~~~~~~~~~~~~~~~~~~~~~~~~~~~~~~~~~~~~
/wrkdirs/usr/ports/java/openjdk7/work/openjdk/hotspot/src/share/vm/utilities/stack.inline.hpp:123:30:
note: in instantiation of member function 'Stack<ObjArrayTask,
1280>::link_offset' requested here
return (E**) ((char*)seg + link_offset());
^
/wrkdirs/usr/ports/java/openjdk7/work/openjdk/hotspot/src/share/vm/utilities/stack.inline.hpp:129:11:
note: in instantiation of member function 'Stack<ObjArrayTask,
1280>::link_addr' requested here
return *link_addr(seg);
^
/wrkdirs/usr/ports/java/openjdk7/work/openjdk/hotspot/src/share/vm/utilities/stack.inline.hpp:159:14:
note: in instantiation of member function 'Stack<ObjArrayTask, 1280>::get_link'
requested here
_cache = get_link(_cache);
^
/wrkdirs/usr/ports/java/openjdk7/work/openjdk/hotspot/src/share/vm/utilities/stack.inline.hpp:62:5:
note: in instantiation of member function 'Stack<ObjArrayTask,
1280>::push_segment' requested here
push_segment();
^
/wrkdirs/usr/ports/java/openjdk7/work/openjdk/hotspot/src/share/vm/gc_implementation/shared/markSweep.inline.hpp:81:19:
note: in instantiation of member function 'Stack<ObjArrayTask, 1280>::push'
requested here
_objarray_stack.push(task);
^
In file included from
/wrkdirs/usr/ports/java/openjdk7/work/openjdk/hotspot/src/share/vm/opto/matcher.cpp:25:
In file included from
/wrkdirs/usr/ports/java/openjdk7/work/openjdk/hotspot/src/share/vm/precompiled/precompiled.hpp:36:
In file included from
/wrkdirs/usr/ports/java/openjdk7/work/openjdk/hotspot/src/share/vm/ci/ciConstant.hpp:29:
In file included from
/wrkdirs/usr/ports/java/openjdk7/work/openjdk/hotspot/src/share/vm/ci/ciNullObject.hpp:30:
In file included from
/wrkdirs/usr/ports/java/openjdk7/work/openjdk/hotspot/src/share/vm/ci/ciUtilities.hpp:28:
In file included from
/wrkdirs/usr/ports/java/openjdk7/work/openjdk/hotspot/src/share/vm/ci/ciEnv.hpp:30:
In file included from
/wrkdirs/usr/ports/java/openjdk7/work/openjdk/hotspot/src/share/vm/classfile/systemDictionary.hpp:29:
In file included from
/wrkdirs/usr/ports/java/openjdk7/work/openjdk/hotspot/src/share/vm/classfile/classLoader.hpp:28:
In file included from
/wrkdirs/usr/ports/java/openjdk7/work/openjdk/hotspot/src/share/vm/classfile/classFileParser.hpp:30:
In file included from
/wrkdirs/usr/ports/java/openjdk7/work/openjdk/hotspot/src/share/vm/oops/oop.inline.hpp:29:
In file included from
/wrkdirs/usr/ports/java/openjdk7/work/openjdk/hotspot/src/share/vm/gc_implementation/shared/markSweep.inline.hpp:30:
/wrkdirs/usr/ports/java/openjdk7/work/openjdk/hotspot/src/share/vm/utilities/stack.inline.hpp:111:40:
warning: implicit conversion changes signedness: 'unsigned long' to 'intptr_t'
(aka 'long') [-Wsign-conversion]
return align_size_up(this->_seg_size * sizeof(E), sizeof(E*));
~~~~~~~~~~~~~ ~~~~~~~~~~~~~~~~^~~~~~~~~~~
In file included from
/wrkdirs/usr/ports/java/openjdk7/work/openjdk/hotspot/src/share/vm/opto/matcher.cpp:25:
In file included from
/wrkdirs/usr/ports/java/openjdk7/work/openjdk/hotspot/src/share/vm/precompiled/precompiled.hpp:36:
In file included from
/wrkdirs/usr/ports/java/openjdk7/work/openjdk/hotspot/src/share/vm/ci/ciConstant.hpp:29:
In file included from
/wrkdirs/usr/ports/java/openjdk7/work/openjdk/hotspot/src/share/vm/ci/ciNullObject.hpp:30:
In file included from
/wrkdirs/usr/ports/java/openjdk7/work/openjdk/hotspot/src/share/vm/ci/ciUtilities.hpp:28:
In file included from
/wrkdirs/usr/ports/java/openjdk7/work/openjdk/hotspot/src/share/vm/ci/ciEnv.hpp:30:
In file included from
/wrkdirs/usr/ports/java/openjdk7/work/openjdk/hotspot/src/share/vm/classfile/systemDictionary.hpp:35:
/wrkdirs/usr/ports/java/openjdk7/work/openjdk/hotspot/src/share/vm/utilities/hashtable.inline.hpp:41:52:
warning: implicit conversion changes signedness: 'int' to 'unsigned long'
[-Wsign-conversion]
_buckets = NEW_C_HEAP_ARRAY2(HashtableBucket<F>, table_size, F, CURRENT_PC);
~~~~~~~~~~~~~~~~~~~~~~~~~~~~~~~~~~~~~~^~~~~~~~~~~~~~~~~~~~~~~~~~
/wrkdirs/usr/ports/java/openjdk7/work/openjdk/hotspot/src/share/vm/memory/allocation.hpp:544:26:
note: expanded from macro 'NEW_C_HEAP_ARRAY2'
(type*) (AllocateHeap((size) * sizeof(type), memflags, pc))
^~~~ ~
/wrkdirs/usr/ports/java/openjdk7/work/openjdk/hotspot/src/share/vm/utilities/hashtable.hpp:241:7:
note: in instantiation of member function
'BasicHashtable<2304>::BasicHashtable' requested here
: BasicHashtable<F>(table_size, entry_size) { }
^
/wrkdirs/usr/ports/java/openjdk7/work/openjdk/hotspot/src/share/vm/classfile/symbolTable.hpp:118:7:
note: in instantiation of member function 'Hashtable<Symbol *,
2304>::Hashtable' requested here
: Hashtable<Symbol*, mtSymbol>(symbol_table_size, sizeof
(HashtableEntry<Symbol*, mtSymbol>)) {}
^
599 warnings generated.
gmake[7]: Leaving directory
'/wrkdirs/usr/ports/java/openjdk7/work/openjdk/build/bsd-amd64/hotspot/outputdir/bsd_amd64_compiler2/product'
gmake[6]: ***
[/wrkdirs/usr/ports/java/openjdk7/work/openjdk/hotspot/make/bsd/makefiles/top.make:129:
the_vm] Error 2
gmake[6]: Leaving directory
'/wrkdirs/usr/ports/java/openjdk7/work/openjdk/build/bsd-amd64/hotspot/outputdir/bsd_amd64_compiler2/product'
gmake[5]: ***
[/wrkdirs/usr/ports/java/openjdk7/work/openjdk/hotspot/make/bsd/Makefile:292:
product] Error 2
gmake[5]: Leaving directory
'/wrkdirs/usr/ports/java/openjdk7/work/openjdk/build/bsd-amd64/hotspot/outputdir'
gmake[4]: *** [Makefile:203: generic_build2] Error 2
gmake[4]: Leaving directory
'/wrkdirs/usr/ports/java/openjdk7/work/openjdk/hotspot/make'
gmake[3]: *** [Makefile:158: product] Error 2
gmake[3]: Leaving directory
'/wrkdirs/usr/ports/java/openjdk7/work/openjdk/hotspot/make'
gmake[2]: *** [make/hotspot-rules.gmk:128: hotspot-build] Error 2
gmake[2]: Leaving directory '/wrkdirs/usr/ports/java/openjdk7/work/openjdk'
gmake[1]: *** [Makefile:251: build_product_image] Error 2
gmake[1]: Leaving directory '/wrkdirs/usr/ports/java/openjdk7/work/openjdk'
===> Compilation failed unexpectedly.
Try to set MAKE_JOBS_UNSAFE=yes and rebuild before reporting the failure to
the maintainer.
*** Error code 1
Stop.
make: stopped in /usr/ports/java/openjdk7
====>> Cleaning up wrkdir
===> Cleaning for openjdk-7.131.00,1
build of java/openjdk7 ended at Mon May 29 08:44:09 EDT 2017
build time: 00:02:30
!!! build failure encountered !!!
--
You are receiving this mail because:
You are the assignee for the bug.
More information about the freebsd-ports-bugs
mailing list