[Bug 219013] devel/libftdi1 Segmentation fault (core dumped) during update

bugzilla-noreply at freebsd.org bugzilla-noreply at freebsd.org
Tue May 2 13:01:12 UTC 2017


https://bugs.freebsd.org/bugzilla/show_bug.cgi?id=219013

            Bug ID: 219013
           Summary: devel/libftdi1 Segmentation fault (core dumped) during
                    update
           Product: Ports & Packages
           Version: Latest
          Hardware: amd64
                OS: Any
            Status: New
          Severity: Affects Only Me
          Priority: ---
         Component: Individual Port(s)
          Assignee: bsam at FreeBSD.org
          Reporter: drhowarddrfine at charter.net
          Assignee: bsam at FreeBSD.org
             Flags: maintainer-feedback?(bsam at FreeBSD.org)

[ 90%] Linking CXX executable test_libftdi1
cd /usr/ports/devel/libftdi1/work/libftdi1-1.3/test && /usr/local/bin/cmake -E
cmake_link_script CMakeFiles/test_libftdi1.dir/link.txt --verbose=1
/usr/local/libexec/ccache/c++  -O2 -pipe -fstack-protector -fno-strict-aliasing
-O2 -pipe -fstack-protector -fno-strict-aliasing   -fstack-protector
CMakeFiles/test_libftdi1.dir/basic.cpp.o
CMakeFiles/test_libftdi1.dir/baudrate.cpp.o  -o test_libftdi1
-Wl,-rpath,/usr/ports/devel/libftdi1/work/libftdi1-1.3/src:/usr/local/lib
../src/libftdi1.so.2.3.0 /usr/local/lib/libboost_unit_test_framework.so -lusb 
--- examples/CMakeFiles/find_all_pp.dir/all ---
[ 90%] Built target find_all_pp
--- test/CMakeFiles/test_libftdi1.dir/all ---
[ 90%] Built target test_libftdi1
--- python/CMakeFiles/doc_i.dir/all ---
Segmentation fault (core dumped)
*** [doc/xml/ftdi_8c.xml] Error code 139

make[4]: stopped in /usr/ports/devel/libftdi1/work/libftdi1-1.3
1 error

make[4]: stopped in /usr/ports/devel/libftdi1/work/libftdi1-1.3
*** [python/CMakeFiles/doc_i.dir/all] Error code 2

make[3]: stopped in /usr/ports/devel/libftdi1/work/libftdi1-1.3
1 error

make[3]: stopped in /usr/ports/devel/libftdi1/work/libftdi1-1.3
*** [all] Error code 2

make[2]: stopped in /usr/ports/devel/libftdi1/work/libftdi1-1.3
1 error

make[2]: stopped in /usr/ports/devel/libftdi1/work/libftdi1-1.3
===> Compilation failed unexpectedly.
Try to set MAKE_JOBS_UNSAFE=yes and rebuild before reporting the failure to
the maintainer.
*** Error code 1

Stop.
make[1]: stopped in /usr/ports/devel/libftdi1
*** Error code 1

-- 
You are receiving this mail because:
You are the assignee for the bug.


More information about the freebsd-ports-bugs mailing list