[package - head-powerpc64-default][devel/gcc-msp430-ti-toolchain] Failed for gcc-msp430-ti-toolchain-8.3.2.2.20200313 in build
pkg-fallout at FreeBSD.org
pkg-fallout at FreeBSD.org
Thu Apr 16 00:27:35 UTC 2020
You are receiving this mail as a port that you maintain
is failing to build on the FreeBSD package build server.
Please investigate the failure and submit a PR to fix
build.
Maintainer: lev at FreeBSD.org
Last committer: lev at FreeBSD.org
Ident: $FreeBSD: head/devel/gcc-msp430-ti-toolchain/Makefile 530395 2020-04-02 18:11:44Z lev $
Log URL: http://pylon.nyi.freebsd.org/data/head-powerpc64-default/p530943_s359682/logs/gcc-msp430-ti-toolchain-8.3.2.2.20200313.log
Build URL: http://pylon.nyi.freebsd.org/build.html?mastername=head-powerpc64-default&build=p530943_s359682
Log:
=>> Building devel/gcc-msp430-ti-toolchain
build started at Wed Apr 15 22:50:58 UTC 2020
port directory: /usr/ports/devel/gcc-msp430-ti-toolchain
package name: gcc-msp430-ti-toolchain-8.3.2.2.20200313
building for: FreeBSD head-powerpc64-default-job-07 13.0-CURRENT FreeBSD 13.0-CURRENT 1300088 powerpc
maintained by: lev at FreeBSD.org
Makefile ident: $FreeBSD: head/devel/gcc-msp430-ti-toolchain/Makefile 530395 2020-04-02 18:11:44Z lev $
Poudriere version: 3.2.8-5-gc81843e5
Host OSVERSION: 1300084
Jail OSVERSION: 1300088
Job Id: 07
!!! Jail is newer than host. (Jail: 1300088, Host: 1300084) !!!
!!! This is not supported. !!!
!!! Host kernel must be same or newer than jail. !!!
!!! Expect build failures. !!!
---Begin Environment---
SHELL=/bin/csh
OSVERSION=1300088
UNAME_v=FreeBSD 13.0-CURRENT 1300088
UNAME_r=13.0-CURRENT
BLOCKSIZE=K
MAIL=/var/mail/root
STATUS=1
HOME=/root
PATH=/sbin:/bin:/usr/sbin:/usr/bin:/usr/local/sbin:/usr/local/bin:/root/bin
LOCALBASE=/usr/local
USER=root
LIBEXECPREFIX=/usr/local/libexec/poudriere
POUDRIERE_VERSION=3.2.8-5-gc81843e5
MASTERMNT=/usr/local/poudriere/data/.m/head-powerpc64-default/ref
POUDRIERE_BUILD_TYPE=bulk
PACKAGE_BUILDING=yes
SAVED_TERM=
PWD=/usr/local/poudriere/data/.m/head-powerpc64-default/ref/.p/pool
P_PORTS_FEATURES=FLAVORS SELECTED_OPTIONS
MASTERNAME=head-powerpc64-default
SCRIPTPREFIX=/usr/local/share/poudriere
OLDPWD=/usr/local/poudriere/data/.m/head-powerpc64-default/ref/.p
SCRIPTPATH=/usr/local/share/poudriere/bulk.sh
POUDRIEREPATH=/usr/local/bin/poudriere
---End Environment---
---Begin Poudriere Port Flags/Env---
PORT_FLAGS=
PKGENV=
FLAVOR=
DEPENDS_ARGS=
MAKE_ARGS=
---End Poudriere Port Flags/Env---
---Begin OPTIONS List---
---End OPTIONS List---
--MAINTAINER--
lev at FreeBSD.org
--End MAINTAINER--
--CONFIGURE_ARGS--
--prefix=/usr/local ${_LATE_CONFIGURE_ARGS}
--End CONFIGURE_ARGS--
--CONFIGURE_ENV--
PATH="/wrkdirs/usr/ports/devel/gcc-msp430-ti-toolchain/work/.bin:/sbin:/bin:/usr/sbin:/usr/bin:/usr/local/sbin:/usr/local/bin:/root/bin:/wrkdirs/usr/ports/devel/gcc-msp430-ti-toolchain/work/install/gcc-msp430-ti-toolchain-8.3.2.2/bin" MAKE=gmake XDG_DATA_HOME=/wrkdirs/usr/ports/devel/gcc-msp430-ti-toolchain/work XDG_CONFIG_HOME=/wrkdirs/usr/ports/devel/gcc-msp430-ti-toolchain/work HOME=/wrkdirs/usr/ports/devel/gcc-msp430-ti-toolchain/work TMPDIR="/tmp" SHELL=/bin/sh CONFIG_SHELL=/bin/sh CONFIG_SITE=/usr/ports/Templates/config.site lt_cv_sys_max_cmd_len=524288
--End CONFIGURE_ENV--
--MAKE_ENV--
PATH="/wrkdirs/usr/ports/devel/gcc-msp430-ti-toolchain/work/.bin:/sbin:/bin:/usr/sbin:/usr/bin:/usr/local/sbin:/usr/local/bin:/root/bin:/wrkdirs/usr/ports/devel/gcc-msp430-ti-toolchain/work/install/gcc-msp430-ti-toolchain-8.3.2.2/bin" XDG_DATA_HOME=/wrkdirs/usr/ports/devel/gcc-msp430-ti-toolchain/work XDG_CONFIG_HOME=/wrkdirs/usr/ports/devel/gcc-msp430-ti-toolchain/work HOME=/wrkdirs/usr/ports/devel/gcc-msp430-ti-toolchain/work TMPDIR="/tmp" NO_PIE=yes MK_DEBUG_FILES=no MK_KERNEL_SYMBOLS=no SHELL=/bin/sh NO_LINT=YES PREFIX=/usr/local LOCALBASE=/usr/local CC="cc" CFLAGS="-O2 -pipe -DLIBICONV_PLUG -fstack-protector-strong -fno-strict-aliasing -std=gnu89 " CPP="cpp" CPPFLAGS="-DLIBICONV_PLUG" LDFLAGS=" -fstack-protector-strong " LIBS="" CXX="c++" CXXFLAGS="-O2 -pipe -DLIBICONV_PLUG -fstack-protector-strong -fno-strict-aliasing -DLIBICONV_PLUG " MANPREFIX="/usr/local/gcc-msp430-ti-toolchain-8.3.2.2" BSD_INSTALL_PROGRAM="install -s -m 555" BSD_INSTALL_LIB="install -s -m 0644"
BSD_INSTALL_SCRIPT="install -m 555" BSD_INSTALL_DATA="install -m 0644" BSD_INSTALL_MAN="install -m 444"
--End MAKE_ENV--
--PLIST_SUB--
TARGET=msp430-elf GCC_VERSION=8.3.1 TI_VERSION=8.3.2.2 DOC_VERSION=646e OSREL=13.0 PREFIX=%D LOCALBASE=/usr/local RESETPREFIX=/usr/local LIB32DIR=lib DOCSDIR="gcc-msp430-ti-toolchain-8.3.2.2/docs" EXAMPLESDIR="share/examples/gcc-msp430-ti-toolchain" DATADIR="share/gcc-msp430-ti-toolchain" WWWDIR="www/gcc-msp430-ti-toolchain" ETCDIR="etc/gcc-msp430-ti-toolchain"
--End PLIST_SUB--
--SUB_LIST--
PREFIX=/usr/local LOCALBASE=/usr/local DATADIR=/usr/local/share/gcc-msp430-ti-toolchain DOCSDIR=/usr/local/gcc-msp430-ti-toolchain-8.3.2.2/docs EXAMPLESDIR=/usr/local/share/examples/gcc-msp430-ti-toolchain WWWDIR=/usr/local/www/gcc-msp430-ti-toolchain ETCDIR=/usr/local/etc/gcc-msp430-ti-toolchain
--End SUB_LIST--
---Begin make.conf---
USE_PACKAGE_DEPENDS=yes
BATCH=yes
WRKDIRPREFIX=/wrkdirs
PORTSDIR=/usr/ports
PACKAGES=/packages
DISTDIR=/distfiles
PACKAGE_BUILDING=yes
PACKAGE_BUILDING_FLAVORS=yes
#### /usr/local/etc/poudriere.d/make.conf ####
# XXX: We really need this but cannot use it while 'make checksum' does not
# try the next mirror on checksum failure. It currently retries the same
# failed mirror and then fails rather then trying another. It *does*
# try the next if the size is mismatched though.
#MASTER_SITE_FREEBSD=yes
# Build ALLOW_MAKE_JOBS_PACKAGES with 2 jobs
MAKE_JOBS_NUMBER=4
#### /usr/ports/Mk/Scripts/ports_env.sh ####
_CCVERSION_921dbbb2=FreeBSD clang version 10.0.0 (git at github.com:llvm/llvm-project.git llvmorg-10.0.0-0-gd32170dbd5b) Target: powerpc64-unknown-freebsd13.0 Thread model: posix InstalledDir: /usr/bin
_ALTCCVERSION_921dbbb2=none
_CXXINTERNAL_acaad9ca=FreeBSD clang version 10.0.0 (git at github.com:llvm/llvm-project.git llvmorg-10.0.0-0-gd32170dbd5b) Target: powerpc64-unknown-freebsd13.0 Thread model: posix InstalledDir: /usr/bin "/usr/bin/ld" "--eh-frame-hdr" "-dynamic-linker" "/libexec/ld-elf.so.1" "--enable-new-dtags" "-o" "a.out" "/usr/lib/crt1.o" "/usr/lib/crti.o" "/usr/lib/crtbegin.o" "-L/usr/lib" "/dev/null" "-lc++" "-lm" "-lgcc" "--as-needed" "-lgcc_s" "--no-as-needed" "-lc" "-lgcc" "--as-needed" "-lgcc_s" "--no-as-needed" "/usr/lib/crtend.o" "/usr/lib/crtn.o"
CC_OUTPUT_921dbbb2_58173849=yes
CC_OUTPUT_921dbbb2_9bdba57c=yes
CC_OUTPUT_921dbbb2_6a4fe7f5=yes
CC_OUTPUT_921dbbb2_6bcac02b=yes
CC_OUTPUT_921dbbb2_67d20829=yes
CC_OUTPUT_921dbbb2_bfa62e83=yes
CC_OUTPUT_921dbbb2_f0b4d593=yes
CC_OUTPUT_921dbbb2_308abb44=yes
CC_OUTPUT_921dbbb2_f00456e5=yes
CC_OUTPUT_921dbbb2_65ad290d=yes
CC_OUTPUT_921dbbb2_f2776b26=yes
CC_OUTPUT_921dbbb2_b2657cc3=yes
CC_OUTPUT_921dbbb2_380987f7=yes
CC_OUTPUT_921dbbb2_160933ec=yes
CC_OUTPUT_921dbbb2_fb62803b=yes
_OBJC_CCVERSION_921dbbb2=FreeBSD clang version 10.0.0 (git at github.com:llvm/llvm-project.git llvmorg-10.0.0-0-gd32170dbd5b) Target: powerpc64-unknown-freebsd13.0 Thread model: posix InstalledDir: /usr/bin
_OBJC_ALTCCVERSION_921dbbb2=none
ARCH=powerpc64
PPC_ABI=ELFv2
OPSYS=FreeBSD
_OSRELEASE=13.0-CURRENT
OSREL=13.0
OSVERSION=1300088
PYTHONBASE=/usr/local
CONFIGURE_MAX_CMD_LEN=524288
HAVE_PORTS_ENV=1
#### Misc Poudriere ####
GID=0
UID=0
DISABLE_MAKE_JOBS=poudriere
---End make.conf---
--Resource limits--
cpu time (seconds, -t) unlimited
file size (512-blocks, -f) unlimited
data seg size (kbytes, -d) 33554432
stack size (kbytes, -s) 524288
core file size (512-blocks, -c) unlimited
max memory size (kbytes, -m) unlimited
locked memory (kbytes, -l) unlimited
max user processes (-u) 89999
open files (-n) 1024
virtual mem size (kbytes, -v) unlimited
swap limit (kbytes, -w) unlimited
socket buffer size (bytes, -b) unlimited
pseudo-terminals (-p) unlimited
kqueues (-k) unlimited
umtx shared locks (-o) unlimited
--End resource limits--
=======================<phase: check-sanity >============================
===> License GPLv2 LGPL20 LGPL21 GPLv3 LGPL3 accepted by the user
===========================================================================
=======================<phase: pkg-depends >============================
===> gcc-msp430-ti-toolchain-8.3.2.2.20200313 depends on file: /usr/local/sbin/pkg - not found
===> Installing existing package /packages/All/pkg-1.14.2.txz
[head-powerpc64-default-job-07] Installing pkg-1.14.2...
[head-powerpc64-default-job-07] Extracting pkg-1.14.2: .......... done
===> gcc-msp430-ti-toolchain-8.3.2.2.20200313 depends on file: /usr/local/sbin/pkg - found
===> Returning to build of gcc-msp430-ti-toolchain-8.3.2.2.20200313
===========================================================================
=======================<phase: fetch-depends >============================
===========================================================================
=======================<phase: fetch >============================
===> License GPLv2 LGPL20 LGPL21 GPLv3 LGPL3 accepted by the user
=> binutils-2.26.tar.bz2 doesn't seem to exist in /portdistfiles/.
=> Attempting to fetch https://mirrors.kernel.org/sourceware/binutils/releases/binutils-2.26.tar.bz2
binutils-2.26.tar.bz2 24 MB 14 MBps 02s
=> gdb-8.1.tar.xz doesn't seem to exist in /portdistfiles/.
=> Attempting to fetch https://ftpmirror.gnu.org/gdb/gdb-8.1.tar.xz
gdb-8.1.tar.xz 19 MB 14 MBps 01s
=> msp430-gcc-8.3.1.25-source-patches.tar.bz2 doesn't seem to exist in /portdistfiles/.
=> Attempting to fetch http://software-dl.ti.com/msp430/msp430_public_sw/mcu/msp430/MSPGCC/8_3_1_0/export/msp430-gcc-8.3.1.25-source-patches.tar.bz2
msp430-gcc-8.3.1.25-source-patches.tar.bz2 344 kB 2455 kBps 00s
=> msp430-gcc-support-files-1.209.zip doesn't seem to exist in /portdistfiles/.
=> Attempting to fetch http://software-dl.ti.com/msp430/msp430_public_sw/mcu/msp430/MSPGCC/8_3_2_2/export/msp430-gcc-support-files-1.209.zip
msp430-gcc-support-files-1.209.zip 21 MB 15 MBps 02s
=> slau646e.pdf doesn't seem to exist in /portdistfiles/.
=> Attempting to fetch http://www.ti.com/lit/ug/slau646e/slau646e.pdf
slau646e.pdf 1364 kB 49 MBps 00s
===> Fetching all distfiles required by gcc-msp430-ti-toolchain-8.3.2.2.20200313 for building
===========================================================================
=======================<phase: checksum >============================
===> License GPLv2 LGPL20 LGPL21 GPLv3 LGPL3 accepted by the user
===> Fetching all distfiles required by gcc-msp430-ti-toolchain-8.3.2.2.20200313 for building
=> SHA256 Checksum OK for gcc-8.3.0.tar.xz.
=> SHA256 Checksum OK for binutils-2.26.tar.bz2.
=> SHA256 Checksum OK for gdb-8.1.tar.xz.
=> SHA256 Checksum OK for newlib-2.4.0.tar.gz.
=> SHA256 Checksum OK for msp430-gcc-8.3.1.25-source-patches.tar.bz2.
=> SHA256 Checksum OK for msp430-gcc-support-files-1.209.zip.
=> SHA256 Checksum OK for slau646e.pdf.
===========================================================================
=======================<phase: extract-depends>============================
===========================================================================
=======================<phase: extract >============================
<snip>
^
/wrkdirs/usr/ports/devel/gcc-msp430-ti-toolchain/work/gcc-8.3.0/gcc/gimple.h:3070:3: warning: array index 1 is past the end of the array (which contains 1 element) [-Warray-bounds]
gs->op[1] = build1_loc (gimple_location (gs), ADDR_EXPR,
^ ~
/wrkdirs/usr/ports/devel/gcc-msp430-ti-toolchain/work/gcc-8.3.0/gcc/gimple.h:372:3: note: array 'op' declared here
tree GTY((length ("%h.num_ops"))) op[1];
^
/wrkdirs/usr/ports/devel/gcc-msp430-ti-toolchain/work/gcc-8.3.0/gcc/gimple.h:3131:10: warning: array index 2 is past the end of the array (which contains 1 element) [-Warray-bounds]
return gs->op[2];
^ ~
/wrkdirs/usr/ports/devel/gcc-msp430-ti-toolchain/work/gcc-8.3.0/gcc/gimple.h:372:3: note: array 'op' declared here
tree GTY((length ("%h.num_ops"))) op[1];
^
/wrkdirs/usr/ports/devel/gcc-msp430-ti-toolchain/work/gcc-8.3.0/gcc/gimple.h:3147:11: warning: array index 2 is past the end of the array (which contains 1 element) [-Warray-bounds]
return &call_stmt->op[2];
^ ~
/wrkdirs/usr/ports/devel/gcc-msp430-ti-toolchain/work/gcc-8.3.0/gcc/gimple.h:372:3: note: array 'op' declared here
tree GTY((length ("%h.num_ops"))) op[1];
^
/wrkdirs/usr/ports/devel/gcc-msp430-ti-toolchain/work/gcc-8.3.0/gcc/gimple.h:3155:3: warning: array index 2 is past the end of the array (which contains 1 element) [-Warray-bounds]
call_stmt->op[2] = chain;
^ ~
/wrkdirs/usr/ports/devel/gcc-msp430-ti-toolchain/work/gcc-8.3.0/gcc/gimple.h:372:3: note: array 'op' declared here
tree GTY((length ("%h.num_ops"))) op[1];
^
/wrkdirs/usr/ports/devel/gcc-msp430-ti-toolchain/work/gcc-8.3.0/gcc/gimple.h:3522:10: warning: array index 1 is past the end of the array (which contains 1 element) [-Warray-bounds]
return gs->op[1];
^ ~
/wrkdirs/usr/ports/devel/gcc-msp430-ti-toolchain/work/gcc-8.3.0/gcc/gimple.h:316:3: note: array 'op' declared here
tree GTY((length ("%h.num_ops"))) op[1];
^
/wrkdirs/usr/ports/devel/gcc-msp430-ti-toolchain/work/gcc-8.3.0/gcc/gimple.h:3548:3: warning: array index 1 is past the end of the array (which contains 1 element) [-Warray-bounds]
gs->op[1] = rhs;
^ ~
/wrkdirs/usr/ports/devel/gcc-msp430-ti-toolchain/work/gcc-8.3.0/gcc/gimple.h:316:3: note: array 'op' declared here
tree GTY((length ("%h.num_ops"))) op[1];
^
/wrkdirs/usr/ports/devel/gcc-msp430-ti-toolchain/work/gcc-8.3.0/gcc/gimple.h:3558:10: warning: array index 2 is past the end of the array (which contains 1 element) [-Warray-bounds]
return gs->op[2];
^ ~
/wrkdirs/usr/ports/devel/gcc-msp430-ti-toolchain/work/gcc-8.3.0/gcc/gimple.h:316:3: note: array 'op' declared here
tree GTY((length ("%h.num_ops"))) op[1];
^
/wrkdirs/usr/ports/devel/gcc-msp430-ti-toolchain/work/gcc-8.3.0/gcc/gimple.h:3568:3: warning: array index 2 is past the end of the array (which contains 1 element) [-Warray-bounds]
gs->op[2] = label;
^ ~
/wrkdirs/usr/ports/devel/gcc-msp430-ti-toolchain/work/gcc-8.3.0/gcc/gimple.h:316:3: note: array 'op' declared here
tree GTY((length ("%h.num_ops"))) op[1];
^
/wrkdirs/usr/ports/devel/gcc-msp430-ti-toolchain/work/gcc-8.3.0/gcc/gimple.h:3578:3: warning: array index 3 is past the end of the array (which contains 1 element) [-Warray-bounds]
gs->op[3] = label;
^ ~
/wrkdirs/usr/ports/devel/gcc-msp430-ti-toolchain/work/gcc-8.3.0/gcc/gimple.h:316:3: note: array 'op' declared here
tree GTY((length ("%h.num_ops"))) op[1];
^
/wrkdirs/usr/ports/devel/gcc-msp430-ti-toolchain/work/gcc-8.3.0/gcc/gimple.h:3588:10: warning: array index 3 is past the end of the array (which contains 1 element) [-Warray-bounds]
return gs->op[3];
^ ~
/wrkdirs/usr/ports/devel/gcc-msp430-ti-toolchain/work/gcc-8.3.0/gcc/gimple.h:316:3: note: array 'op' declared here
tree GTY((length ("%h.num_ops"))) op[1];
^
In file included from /wrkdirs/usr/ports/devel/gcc-msp430-ti-toolchain/work/gcc-8.3.0/gcc/tree-vect-loop.c:50:
In file included from /wrkdirs/usr/ports/devel/gcc-msp430-ti-toolchain/work/gcc-8.3.0/gcc/cgraph.h:25:
/wrkdirs/usr/ports/devel/gcc-msp430-ti-toolchain/work/gcc-8.3.0/gcc/ipa-ref.h:26:1: warning: class 'symtab_node' was previously declared as a struct; this is valid, but may result in linker errors under the Microsoft C++ ABI [-Wmismatched-tags]
class symtab_node;
^
/wrkdirs/usr/ports/devel/gcc-msp430-ti-toolchain/work/gcc-8.3.0/gcc/tree-core.h:1711:9: note: previous use is here
struct symtab_node *symtab_node;
^
In file included from /wrkdirs/usr/ports/devel/gcc-msp430-ti-toolchain/work/gcc-8.3.0/gcc/tree-vect-loop.c:50:
/wrkdirs/usr/ports/devel/gcc-msp430-ti-toolchain/work/gcc-8.3.0/gcc/cgraph.h:95:1: warning: 'symtab_node' defined as a class here but previously declared as a struct; this is valid, but may result in linker errors under the Microsoft C++ ABI [-Wmismatched-tags]
class GTY((desc ("%h.type"), tag ("SYMTAB_SYMBOL"),
^
/wrkdirs/usr/ports/devel/gcc-msp430-ti-toolchain/work/gcc-8.3.0/gcc/tree-core.h:1711:2: note: did you mean class here?
struct symtab_node *symtab_node;
^~~~~~
class
In file included from /wrkdirs/usr/ports/devel/gcc-msp430-ti-toolchain/work/gcc-8.3.0/gcc/tree-vect-loop.c:50:
/wrkdirs/usr/ports/devel/gcc-msp430-ti-toolchain/work/gcc-8.3.0/gcc/cgraph.h:254:11: warning: struct 'symtab_node' was previously declared as a class; this is valid, but may result in linker errors under the Microsoft C++ ABI [-Wmismatched-tags]
struct symtab_node *ref = NULL);
^
/wrkdirs/usr/ports/devel/gcc-msp430-ti-toolchain/work/gcc-8.3.0/gcc/cgraph.h:97:3: note: previous use is here
symtab_node
^
/wrkdirs/usr/ports/devel/gcc-msp430-ti-toolchain/work/gcc-8.3.0/gcc/cgraph.h:920:5: warning: struct 'symtab_node' was previously declared as a class; this is valid, but may result in linker errors under the Microsoft C++ ABI [-Wmismatched-tags]
struct symtab_node *ref = NULL);
^
/wrkdirs/usr/ports/devel/gcc-msp430-ti-toolchain/work/gcc-8.3.0/gcc/cgraph.h:97:3: note: previous use is here
symtab_node
^
/wrkdirs/usr/ports/devel/gcc-msp430-ti-toolchain/work/gcc-8.3.0/gcc/cgraph.h:930:6: warning: struct 'symtab_node' was previously declared as a class; this is valid, but may result in linker errors under the Microsoft C++ ABI [-Wmismatched-tags]
struct symtab_node *ref = NULL);
^
/wrkdirs/usr/ports/devel/gcc-msp430-ti-toolchain/work/gcc-8.3.0/gcc/cgraph.h:97:3: note: previous use is here
symtab_node
^
/wrkdirs/usr/ports/devel/gcc-msp430-ti-toolchain/work/gcc-8.3.0/gcc/cgraph.h:1648:10: warning: class 'cgraph_node' was previously declared as a struct; this is valid, but may result in linker errors under the Microsoft C++ ABI [-Wmismatched-tags]
friend class cgraph_node;
^
/wrkdirs/usr/ports/devel/gcc-msp430-ti-toolchain/work/gcc-8.3.0/gcc/cgraph.h:894:39: note: previous use is here
struct GTY((tag ("SYMTAB_FUNCTION"))) cgraph_node : public symtab_node {
^
/wrkdirs/usr/ports/devel/gcc-msp430-ti-toolchain/work/gcc-8.3.0/gcc/cgraph.h:1648:10: note: did you mean struct here?
friend class cgraph_node;
^~~~~
struct
/wrkdirs/usr/ports/devel/gcc-msp430-ti-toolchain/work/gcc-8.3.0/gcc/cgraph.h:2031:10: warning: class 'cgraph_node' was previously declared as a struct; this is valid, but may result in linker errors under the Microsoft C++ ABI [-Wmismatched-tags]
friend class cgraph_node;
^
/wrkdirs/usr/ports/devel/gcc-msp430-ti-toolchain/work/gcc-8.3.0/gcc/cgraph.h:894:39: note: previous use is here
struct GTY((tag ("SYMTAB_FUNCTION"))) cgraph_node : public symtab_node {
^
/wrkdirs/usr/ports/devel/gcc-msp430-ti-toolchain/work/gcc-8.3.0/gcc/cgraph.h:2031:10: note: did you mean struct here?
friend class cgraph_node;
^~~~~
struct
/wrkdirs/usr/ports/devel/gcc-msp430-ti-toolchain/work/gcc-8.3.0/gcc/cgraph.h:2032:10: warning: class 'cgraph_edge' was previously declared as a struct; this is valid, but may result in linker errors under the Microsoft C++ ABI [-Wmismatched-tags]
friend class cgraph_edge;
^
/wrkdirs/usr/ports/devel/gcc-msp430-ti-toolchain/work/gcc-8.3.0/gcc/cgraph.h:1647:17: note: previous use is here
for_user)) cgraph_edge {
^
/wrkdirs/usr/ports/devel/gcc-msp430-ti-toolchain/work/gcc-8.3.0/gcc/cgraph.h:2032:10: note: did you mean struct here?
friend class cgraph_edge;
^~~~~
struct
/wrkdirs/usr/ports/devel/gcc-msp430-ti-toolchain/work/gcc-8.3.0/gcc/tree-vect-loop.c:4979:12: error: expected unqualified-id
tree vec_step = build_vector_from_val (cr_index_vector_type, step);
^
/wrkdirs/usr/ports/devel/gcc-msp430-ti-toolchain/work/gcc-8.3.0/gcc/tree-vect-loop.c:4985:39: error: expected expression
create_iv (series_vect, vec_step, NULL_TREE, loop, &incr_gsi,
^
/wrkdirs/usr/ports/devel/gcc-msp430-ti-toolchain/work/gcc-8.3.0/gcc/tree-vect-loop.c:7653:27: error: expected unqualified-id
tree new_vec, vec_init, vec_step, t;
^
/wrkdirs/usr/ports/devel/gcc-msp430-ti-toolchain/work/gcc-8.3.0/gcc/tree-vect-loop.c:7653:26: error: expected ';' at end of declaration
tree new_vec, vec_init, vec_step, t;
^
;
/wrkdirs/usr/ports/devel/gcc-msp430-ti-toolchain/work/gcc-8.3.0/gcc/tree-vect-loop.c:7846:16: error: expected expression
vec_step = vect_init_vector (phi, new_vec, vectype, NULL);
^
/wrkdirs/usr/ports/devel/gcc-msp430-ti-toolchain/work/gcc-8.3.0/gcc/tree-vect-loop.c:7885:75: error: expected expression
new_stmt = gimple_build_assign (vec_def, PLUS_EXPR, induc_def, vec_step);
^
/wrkdirs/usr/ports/devel/gcc-msp430-ti-toolchain/work/gcc-8.3.0/gcc/tree-vect-loop.c:7916:13: error: expected expression
vec_step = vect_init_vector (phi, new_vec, vectype, NULL);
^
/wrkdirs/usr/ports/devel/gcc-msp430-ti-toolchain/work/gcc-8.3.0/gcc/tree-vect-loop.c:7927:25: error: expected expression
def, vec_step);
^
/wrkdirs/usr/ports/devel/gcc-msp430-ti-toolchain/work/gcc-8.3.0/gcc/tree-vect-loop.c:8049:3: error: use of undeclared identifier 't'
t = unshare_expr (new_name);
^
/wrkdirs/usr/ports/devel/gcc-msp430-ti-toolchain/work/gcc-8.3.0/gcc/tree-vect-loop.c:8052:45: error: use of undeclared identifier 't'
new_vec = build_vector_from_val (vectype, t);
^
/wrkdirs/usr/ports/devel/gcc-msp430-ti-toolchain/work/gcc-8.3.0/gcc/tree-vect-loop.c:8053:12: error: expected expression
vec_step = vect_init_vector (phi, new_vec, vectype, NULL);
^
/wrkdirs/usr/ports/devel/gcc-msp430-ti-toolchain/work/gcc-8.3.0/gcc/tree-vect-loop.c:8076:74: error: expected expression
new_stmt = gimple_build_assign (vec_def, PLUS_EXPR, induc_def, vec_step);
^
/wrkdirs/usr/ports/devel/gcc-msp430-ti-toolchain/work/gcc-8.3.0/gcc/tree-vect-loop.c:8116:7: error: use of undeclared identifier 't'
t = unshare_expr (new_name);
^
/wrkdirs/usr/ports/devel/gcc-msp430-ti-toolchain/work/gcc-8.3.0/gcc/tree-vect-loop.c:8119:49: error: use of undeclared identifier 't'
new_vec = build_vector_from_val (vectype, t);
^
/wrkdirs/usr/ports/devel/gcc-msp430-ti-toolchain/work/gcc-8.3.0/gcc/tree-vect-loop.c:8120:16: error: expected expression
vec_step = vect_init_vector (phi, new_vec, vectype, NULL);
^
/wrkdirs/usr/ports/devel/gcc-msp430-ti-toolchain/work/gcc-8.3.0/gcc/tree-vect-loop.c:8128:25: error: expected expression
vec_def, vec_step);
^
In file included from /wrkdirs/usr/ports/devel/gcc-msp430-ti-toolchain/work/gcc-8.3.0/gcc/tree-vect-loop.c:24:
In file included from /wrkdirs/usr/ports/devel/gcc-msp430-ti-toolchain/work/gcc-8.3.0/gcc/coretypes.h:414:
/wrkdirs/usr/ports/devel/gcc-msp430-ti-toolchain/work/gcc-8.3.0/gcc/poly-int.h:1240:37: warning: array index 1 is past the end of the array (which contains 1 element) [-Warray-bounds]
return maybe_eq_2 (a.coeffs[0], a.coeffs[1], b);
^ ~
/wrkdirs/usr/ports/devel/gcc-msp430-ti-toolchain/work/gcc-8.3.0/gcc/tree-vect-loop.c:1730:15: note: in instantiation of function template specialization 'maybe_eq<1, unsigned long, unsigned int>' requested here
gcc_assert (known_ne (vectorization_factor, 0U));
^
/wrkdirs/usr/ports/devel/gcc-msp430-ti-toolchain/work/gcc-8.3.0/gcc/poly-int.h:1307:26: note: expanded from macro 'known_ne'
#define known_ne(A, B) (!maybe_eq (A, B))
^
/wrkdirs/usr/ports/devel/gcc-msp430-ti-toolchain/work/gcc-8.3.0/gcc/poly-int.h:383:3: note: array 'coeffs' declared here
C coeffs[N];
^
141 warnings and 16 errors generated.
gmake[3]: *** [Makefile:1111: tree-vect-loop.o] Error 1
gmake[3]: Leaving directory '/wrkdirs/usr/ports/devel/gcc-msp430-ti-toolchain/work/build/gcc/gcc'
gmake[2]: *** [Makefile:4265: all-gcc] Error 2
gmake[2]: Leaving directory '/wrkdirs/usr/ports/devel/gcc-msp430-ti-toolchain/work/build/gcc'
gmake[1]: *** [Makefile:903: all] Error 2
gmake[1]: Leaving directory '/wrkdirs/usr/ports/devel/gcc-msp430-ti-toolchain/work/build/gcc'
*** Error code 2
Stop.
make: stopped in /usr/ports/devel/gcc-msp430-ti-toolchain
More information about the freebsd-pkg-fallout
mailing list