[package - 120powerpc64-quarterly][textproc/R-cran-readxl] Failed for R-cran-readxl-1.3.1_1 in stage
pkg-fallout at FreeBSD.org
pkg-fallout at FreeBSD.org
Sun Nov 17 08:46:02 UTC 2019
You are receiving this mail as a port that you maintain
is failing to build on the FreeBSD package build server.
Please investigate the failure and submit a PR to fix
build.
Maintainer: dbn at FreeBSD.org
Last committer: wen at FreeBSD.org
Ident: $FreeBSD: branches/2019Q4/textproc/R-cran-readxl/Makefile 510919 2019-09-03 03:22:53Z wen $
Log URL: http://pylon.nyi.freebsd.org/data/120powerpc64-quarterly/517637/logs/R-cran-readxl-1.3.1_1.log
Build URL: http://pylon.nyi.freebsd.org/build.html?mastername=120powerpc64-quarterly&build=517637
Log:
=>> Building textproc/R-cran-readxl
build started at Sun Nov 17 08:42:13 UTC 2019
port directory: /usr/ports/textproc/R-cran-readxl
package name: R-cran-readxl-1.3.1_1
building for: FreeBSD 120powerpc64-quarterly-job-20 12.0-RELEASE-p12 FreeBSD 12.0-RELEASE-p12 1200086 powerpc
maintained by: dbn at FreeBSD.org
Makefile ident: $FreeBSD: branches/2019Q4/textproc/R-cran-readxl/Makefile 510919 2019-09-03 03:22:53Z wen $
Poudriere version: 3.2.8-5-gc81843e5
Host OSVERSION: 1300047
Jail OSVERSION: 1200086
Job Id: 20
---Begin Environment---
SHELL=/bin/csh
OSVERSION=1200086
UNAME_v=FreeBSD 12.0-RELEASE-p12 1200086
UNAME_r=12.0-RELEASE-p12
BLOCKSIZE=K
MAIL=/var/mail/root
STATUS=1
HOME=/root
PATH=/sbin:/bin:/usr/sbin:/usr/bin:/usr/local/sbin:/usr/local/bin:/root/bin
LOCALBASE=/usr/local
USER=root
LIBEXECPREFIX=/usr/local/libexec/poudriere
POUDRIERE_VERSION=3.2.8-5-gc81843e5
MASTERMNT=/usr/local/poudriere/data/.m/120powerpc64-quarterly/ref
POUDRIERE_BUILD_TYPE=bulk
PACKAGE_BUILDING=yes
SAVED_TERM=
PWD=/usr/local/poudriere/data/.m/120powerpc64-quarterly/ref/.p/pool
P_PORTS_FEATURES=FLAVORS SELECTED_OPTIONS
MASTERNAME=120powerpc64-quarterly
SCRIPTPREFIX=/usr/local/share/poudriere
OLDPWD=/usr/local/poudriere/data/.m/120powerpc64-quarterly/ref/.p
SCRIPTPATH=/usr/local/share/poudriere/bulk.sh
POUDRIEREPATH=/usr/local/bin/poudriere
---End Environment---
---Begin Poudriere Port Flags/Env---
PORT_FLAGS=
PKGENV=
FLAVOR=
DEPENDS_ARGS=
MAKE_ARGS=
---End Poudriere Port Flags/Env---
---Begin OPTIONS List---
---End OPTIONS List---
--MAINTAINER--
dbn at FreeBSD.org
--End MAINTAINER--
--CONFIGURE_ARGS--
--End CONFIGURE_ARGS--
--CONFIGURE_ENV--
F77="gfortran9" FC="gfortran9" FFLAGS="-O -Wl,-rpath=/usr/local/lib/gcc9" FCFLAGS="-Wl,-rpath=/usr/local/lib/gcc9" XDG_DATA_HOME=/wrkdirs/usr/ports/textproc/R-cran-readxl/work XDG_CONFIG_HOME=/wrkdirs/usr/ports/textproc/R-cran-readxl/work HOME=/wrkdirs/usr/ports/textproc/R-cran-readxl/work TMPDIR="/tmp" PATH=/wrkdirs/usr/ports/textproc/R-cran-readxl/work/.bin:/sbin:/bin:/usr/sbin:/usr/bin:/usr/local/sbin:/usr/local/bin:/root/bin SHELL=/bin/sh CONFIG_SHELL=/bin/sh
--End CONFIGURE_ENV--
--MAKE_ENV--
F77="gfortran9" FC="gfortran9" FFLAGS="-O -Wl,-rpath=/usr/local/lib/gcc9" FCFLAGS="-Wl,-rpath=/usr/local/lib/gcc9" XDG_DATA_HOME=/wrkdirs/usr/ports/textproc/R-cran-readxl/work XDG_CONFIG_HOME=/wrkdirs/usr/ports/textproc/R-cran-readxl/work HOME=/wrkdirs/usr/ports/textproc/R-cran-readxl/work TMPDIR="/tmp" PATH=/wrkdirs/usr/ports/textproc/R-cran-readxl/work/.bin:/sbin:/bin:/usr/sbin:/usr/bin:/usr/local/sbin:/usr/local/bin:/root/bin NO_PIE=yes MK_DEBUG_FILES=no MK_KERNEL_SYMBOLS=no SHELL=/bin/sh NO_LINT=YES ADDR2LINE="/usr/local/bin/addr2line" AR="/usr/local/bin/ar" AS="/usr/local/bin/as" CPPFILT="/usr/local/bin/c++filt" GPROF="/usr/local/bin/gprof" LD="/usr/local/bin/ld" NM="/usr/local/bin/nm" OBJCOPY="/usr/local/bin/objcopy" OBJDUMP="/usr/local/bin/objdump" RANLIB="/usr/local/bin/ranlib" READELF="/usr/local/bin/readelf" SIZE="/usr/local/bin/size" STRINGS="/usr/local/bin/strings" PREFIX=/usr/local LOCALBASE=/usr/local CC="cc" CFLAGS="-O2 -pipe -fstack-protector-strong -fno-strict-a
liasing " CPP="cpp" CPPFLAGS="" LDFLAGS=" -Wl,-rpath=/usr/local/lib/gcc9 -L/usr/local/lib/gcc9 -B/usr/local/bin -fstack-protector-strong " LIBS="" CXX="c++" CXXFLAGS="-O2 -pipe -fstack-protector-strong -fno-strict-aliasing " MANPREFIX="/usr/local" BSD_INSTALL_PROGRAM="install -s -m 555" BSD_INSTALL_LIB="install -s -m 0644" BSD_INSTALL_SCRIPT="install -m 555" BSD_INSTALL_DATA="install -m 0644" BSD_INSTALL_MAN="install -m 444"
--End MAKE_ENV--
--PLIST_SUB--
R_MOD_DIR=lib/R/library/readxl OSREL=12.0 PREFIX=%D LOCALBASE=/usr/local RESETPREFIX=/usr/local LIB32DIR=lib DOCSDIR="share/doc/readxl" EXAMPLESDIR="share/examples/readxl" DATADIR="share/readxl" WWWDIR="www/readxl" ETCDIR="etc/readxl"
--End PLIST_SUB--
--SUB_LIST--
PREFIX=/usr/local LOCALBASE=/usr/local DATADIR=/usr/local/share/readxl DOCSDIR=/usr/local/share/doc/readxl EXAMPLESDIR=/usr/local/share/examples/readxl WWWDIR=/usr/local/www/readxl ETCDIR=/usr/local/etc/readxl
--End SUB_LIST--
---Begin make.conf---
USE_PACKAGE_DEPENDS=yes
BATCH=yes
WRKDIRPREFIX=/wrkdirs
PORTSDIR=/usr/ports
PACKAGES=/packages
DISTDIR=/distfiles
PACKAGE_BUILDING=yes
PACKAGE_BUILDING_FLAVORS=yes
#### /usr/local/etc/poudriere.d/make.conf ####
# XXX: We really need this but cannot use it while 'make checksum' does not
# try the next mirror on checksum failure. It currently retries the same
# failed mirror and then fails rather then trying another. It *does*
# try the next if the size is mismatched though.
#MASTER_SITE_FREEBSD=yes
# Build ALLOW_MAKE_JOBS_PACKAGES with 2 jobs
MAKE_JOBS_NUMBER=4
#### /usr/ports/Mk/Scripts/ports_env.sh ####
_CCVERSION_921dbbb2=cc (GCC) 4.2.1 20070831 patched [FreeBSD] Copyright (C) 2007 Free Software Foundation, Inc. This is free software; see the source for copying conditions. There is NO warranty; not even for MERCHANTABILITY or FITNESS FOR A PARTICULAR PURPOSE.
_ALTCCVERSION_921dbbb2=none
_CXXINTERNAL_acaad9ca=Using built-in specs. Target: powerpc64-undermydesk-freebsd Configured with: FreeBSD/powerpc64 system compiler Thread model: posix gcc version 4.2.1 20070831 patched [FreeBSD] "/usr/bin/ld" "--eh-frame-hdr" "-Qy" "-melf64ppc_fbsd" "--enable-new-dtags" "-dynamic-linker" "/libexec/ld-elf.so.1" "/usr/lib/crt1.o" "/usr/lib/crti.o" "/usr/lib/crtbegin.o" "-L/usr/lib" "-L/usr/lib" "/dev/null" "-lstdc++" "-lm" "-lgcc_s" "-lgcc" "-lc" "-lgcc_s" "-lgcc" "/usr/lib/crtsavres.o" "/usr/lib/crtend.o" "/usr/lib/crtn.o"
CC_OUTPUT_921dbbb2_58173849=yes
CC_OUTPUT_921dbbb2_9bdba57c=yes
CC_OUTPUT_921dbbb2_6a4fe7f5=cc1: error: unrecognized command line option "-std=c11"
CC_OUTPUT_921dbbb2_6bcac02b=yes
CC_OUTPUT_921dbbb2_67d20829=yes
CC_OUTPUT_921dbbb2_bfa62e83=cc1: error: unrecognized command line option "-std=gnu11"
CC_OUTPUT_921dbbb2_f0b4d593=yes
CC_OUTPUT_921dbbb2_308abb44=cc1plus: error: unrecognized command line option "-std=c++0x"
CC_OUTPUT_921dbbb2_f00456e5=cc1plus: error: unrecognized command line option "-std=c++11"
CC_OUTPUT_921dbbb2_65ad290d=cc1plus: error: unrecognized command line option "-std=c++14"
CC_OUTPUT_921dbbb2_f2776b26=cc1plus: error: unrecognized command line option "-std=c++17"
CC_OUTPUT_921dbbb2_b2657cc3=yes
CC_OUTPUT_921dbbb2_380987f7=cc1plus: error: unrecognized command line option "-std=gnu++11"
CC_OUTPUT_921dbbb2_160933ec=cc1plus: error: unrecognized command line option "-std=gnu++14"
CC_OUTPUT_921dbbb2_fb62803b=cc1plus: error: unrecognized command line option "-std=gnu++17"
_OBJC_CCVERSION_921dbbb2=cc (GCC) 4.2.1 20070831 patched [FreeBSD] Copyright (C) 2007 Free Software Foundation, Inc. This is free software; see the source for copying conditions. There is NO warranty; not even for MERCHANTABILITY or FITNESS FOR A PARTICULAR PURPOSE.
_OBJC_ALTCCVERSION_921dbbb2=none
ARCH=powerpc64
OPSYS=FreeBSD
_OSRELEASE=12.0-RELEASE-p12
OSREL=12.0
OSVERSION=1200086
PYTHONBASE=/usr/local
CONFIGURE_MAX_CMD_LEN=262144
HAVE_PORTS_ENV=1
#### Misc Poudriere ####
GID=0
UID=0
DISABLE_MAKE_JOBS=poudriere
---End make.conf---
--Resource limits--
cpu time (seconds, -t) unlimited
file size (512-blocks, -f) unlimited
data seg size (kbytes, -d) 33554432
stack size (kbytes, -s) 524288
core file size (512-blocks, -c) unlimited
max memory size (kbytes, -m) unlimited
locked memory (kbytes, -l) unlimited
max user processes (-u) 89999
open files (-n) 1024
virtual mem size (kbytes, -v) unlimited
swap limit (kbytes, -w) unlimited
socket buffer size (bytes, -b) unlimited
pseudo-terminals (-p) unlimited
kqueues (-k) unlimited
umtx shared locks (-o) unlimited
--End resource limits--
=======================<phase: check-sanity >============================
===> License GPLv3 accepted by the user
===========================================================================
=======================<phase: pkg-depends >============================
===> R-cran-readxl-1.3.1_1 depends on file: /usr/local/sbin/pkg - not found
===> Installing existing package /packages/All/pkg-1.12.0.txz
[120powerpc64-quarterly-job-20] Installing pkg-1.12.0...
[120powerpc64-quarterly-job-20] Extracting pkg-1.12.0: .......... done
===> R-cran-readxl-1.3.1_1 depends on file: /usr/local/sbin/pkg - found
===> Returning to build of R-cran-readxl-1.3.1_1
===========================================================================
=======================<phase: fetch-depends >============================
===========================================================================
=======================<phase: fetch >============================
===> License GPLv3 accepted by the user
===> Fetching all distfiles required by R-cran-readxl-1.3.1_1 for building
===========================================================================
=======================<phase: checksum >============================
===> License GPLv3 accepted by the user
===> Fetching all distfiles required by R-cran-readxl-1.3.1_1 for building
=> SHA256 Checksum OK for readxl_1.3.1.tar.gz.
===========================================================================
=======================<phase: extract-depends>============================
===========================================================================
=======================<phase: extract >============================
===> License GPLv3 accepted by the user
===> Fetching all distfiles required by R-cran-readxl-1.3.1_1 for building
===> Extracting for R-cran-readxl-1.3.1_1
=> SHA256 Checksum OK for readxl_1.3.1.tar.gz.
===========================================================================
=======================<phase: patch-depends >============================
===========================================================================
=======================<phase: patch >============================
===> Patching for R-cran-readxl-1.3.1_1
===========================================================================
=======================<phase: build-depends >============================
===> R-cran-readxl-1.3.1_1 depends on package: R-cran-knitr>0 - not found
===> Installing existing package /packages/All/R-cran-knitr-1.25.txz
[120powerpc64-quarterly-job-20] Installing R-cran-knitr-1.25...
[120powerpc64-quarterly-job-20] `-- Installing R-3.6.1_2...
[120powerpc64-quarterly-job-20] | `-- Installing cairo-1.16.0,2...
[120powerpc64-quarterly-job-20] | | `-- Installing fontconfig-2.12.6,1...
[120powerpc64-quarterly-job-20] | | `-- Installing expat-2.2.8...
[120powerpc64-quarterly-job-20] | | `-- Extracting expat-2.2.8: .......... done
[120powerpc64-quarterly-job-20] | | `-- Installing freetype2-2.10.1...
[120powerpc64-quarterly-job-20] | | `-- Extracting freetype2-2.10.1: .......... done
[120powerpc64-quarterly-job-20] | | `-- Extracting fontconfig-2.12.6,1: .......... done
Running fc-cache to build fontconfig cache...
/usr/local/share/fonts: skipping, no such directory
/usr/local/lib/X11/fonts: skipping, no such directory
/var/db/fontconfig: cleaning cache directory
fc-cache: succeeded
[120powerpc64-quarterly-job-20] | | `-- Installing gettext-runtime-0.20.1...
[120powerpc64-quarterly-job-20] | | `-- Installing indexinfo-0.3.1...
[120powerpc64-quarterly-job-20] | | `-- Extracting indexinfo-0.3.1: .... done
[120powerpc64-quarterly-job-20] | | `-- Extracting gettext-runtime-0.20.1: .......... done
[120powerpc64-quarterly-job-20] | | `-- Installing glib-2.56.3_6,1...
<snip>
from Spinner.h:4,
from XlsWorkSheet.h:7,
from XlsWorkSheet.cpp:3:
/usr/include/sys/time.h:186:17: error: 'sbintime_t' does not name a type; did you mean 'bintime'?
186 | static __inline sbintime_t
| ^~~~~~~~~~
| bintime
/usr/include/sys/time.h:194:9: error: 'sbintime_t' was not declared in this scope; did you mean 'xls::sbintime_t'?
194 | sbttoms(sbintime_t _sbt)
| ^~~~~~~~~~
| xls::sbintime_t
In file included from ./libxls/xlstypes.h:40,
from ./libxls/xls.h:42,
from ColSpec.h:5,
from XlsWorkSheet.cpp:2:
/usr/include/sys/types.h:196:19: note: 'xls::sbintime_t' declared here
196 | typedef __int64_t sbintime_t;
| ^~~~~~~~~~
In file included from /usr/local/lib/R/library/progress/include/RProgress.h:7,
from Spinner.h:4,
from XlsWorkSheet.h:7,
from XlsWorkSheet.cpp:3:
/usr/include/sys/time.h:200:17: error: 'sbintime_t' does not name a type; did you mean 'bintime'?
200 | static __inline sbintime_t
| ^~~~~~~~~~
| bintime
/usr/include/sys/time.h: In function 'void bintime2timeval(const bintime*, timeval*)':
/usr/include/sys/time.h:243:5: error: invalid use of incomplete type 'struct timeval'
243 | _tv->tv_sec = _bt->sec;
| ^~
In file included from /usr/local/lib/R/library/progress/include/RProgress.h:6,
from Spinner.h:4,
from XlsWorkSheet.h:7,
from XlsWorkSheet.cpp:3:
/usr/include/unistd.h:487:8: note: forward declaration of 'struct timeval'
487 | struct timeval; /* select(2) */
| ^~~~~~~
In file included from /usr/local/lib/R/library/progress/include/RProgress.h:7,
from Spinner.h:4,
from XlsWorkSheet.h:7,
from XlsWorkSheet.cpp:3:
/usr/include/sys/time.h:244:5: error: invalid use of incomplete type 'struct timeval'
244 | _tv->tv_usec = ((uint64_t)1000000 * (uint32_t)(_bt->frac >> 32)) >> 32;
| ^~
In file included from /usr/local/lib/R/library/progress/include/RProgress.h:6,
from Spinner.h:4,
from XlsWorkSheet.h:7,
from XlsWorkSheet.cpp:3:
/usr/include/unistd.h:487:8: note: forward declaration of 'struct timeval'
487 | struct timeval; /* select(2) */
| ^~~~~~~
In file included from /usr/local/lib/R/library/progress/include/RProgress.h:7,
from Spinner.h:4,
from XlsWorkSheet.h:7,
from XlsWorkSheet.cpp:3:
/usr/include/sys/time.h: In function 'void timeval2bintime(const timeval*, bintime*)':
/usr/include/sys/time.h:251:16: error: invalid use of incomplete type 'const struct timeval'
251 | _bt->sec = _tv->tv_sec;
| ^~
In file included from /usr/local/lib/R/library/progress/include/RProgress.h:6,
from Spinner.h:4,
from XlsWorkSheet.h:7,
from XlsWorkSheet.cpp:3:
/usr/include/unistd.h:487:8: note: forward declaration of 'struct timeval'
487 | struct timeval; /* select(2) */
| ^~~~~~~
In file included from /usr/local/lib/R/library/progress/include/RProgress.h:7,
from Spinner.h:4,
from XlsWorkSheet.h:7,
from XlsWorkSheet.cpp:3:
/usr/include/sys/time.h:253:17: error: invalid use of incomplete type 'const struct timeval'
253 | _bt->frac = _tv->tv_usec * (uint64_t)18446744073709LL;
| ^~
In file included from /usr/local/lib/R/library/progress/include/RProgress.h:6,
from Spinner.h:4,
from XlsWorkSheet.h:7,
from XlsWorkSheet.cpp:3:
/usr/include/unistd.h:487:8: note: forward declaration of 'struct timeval'
487 | struct timeval; /* select(2) */
| ^~~~~~~
In file included from /usr/local/lib/R/library/progress/include/RProgress.h:7,
from Spinner.h:4,
from XlsWorkSheet.h:7,
from XlsWorkSheet.cpp:3:
/usr/include/sys/time.h: At global scope:
/usr/include/sys/time.h:257:9: error: 'sbintime_t' was not declared in this scope; did you mean 'xls::sbintime_t'?
257 | sbttots(sbintime_t _sbt)
| ^~~~~~~~~~
| xls::sbintime_t
In file included from ./libxls/xlstypes.h:40,
from ./libxls/xls.h:42,
from ColSpec.h:5,
from XlsWorkSheet.cpp:2:
/usr/include/sys/types.h:196:19: note: 'xls::sbintime_t' declared here
196 | typedef __int64_t sbintime_t;
| ^~~~~~~~~~
In file included from /usr/local/lib/R/library/progress/include/RProgress.h:7,
from Spinner.h:4,
from XlsWorkSheet.h:7,
from XlsWorkSheet.cpp:3:
/usr/include/sys/time.h:258:1: error: expected ',' or ';' before '{' token
258 | {
| ^
/usr/include/sys/time.h:266:17: error: 'sbintime_t' does not name a type; did you mean 'bintime'?
266 | static __inline sbintime_t
| ^~~~~~~~~~
| bintime
/usr/include/sys/time.h:274:9: error: variable 'timeval sbttotv' has initializer but incomplete type
274 | sbttotv(sbintime_t _sbt)
| ^~~~~~~~~~
/usr/include/sys/time.h:274:9: error: 'sbintime_t' was not declared in this scope; did you mean 'xls::sbintime_t'?
274 | sbttotv(sbintime_t _sbt)
| ^~~~~~~~~~
| xls::sbintime_t
In file included from ./libxls/xlstypes.h:40,
from ./libxls/xls.h:42,
from ColSpec.h:5,
from XlsWorkSheet.cpp:2:
/usr/include/sys/types.h:196:19: note: 'xls::sbintime_t' declared here
196 | typedef __int64_t sbintime_t;
| ^~~~~~~~~~
In file included from /usr/local/lib/R/library/progress/include/RProgress.h:7,
from Spinner.h:4,
from XlsWorkSheet.h:7,
from XlsWorkSheet.cpp:3:
/usr/include/sys/time.h:275:1: error: expected ',' or ';' before '{' token
275 | {
| ^
/usr/include/sys/time.h:283:17: error: 'sbintime_t' does not name a type; did you mean 'bintime'?
283 | static __inline sbintime_t
| ^~~~~~~~~~
| bintime
/usr/include/sys/time.h:389:17: error: field 'it_interval' has incomplete type 'timeval'
389 | struct timeval it_interval; /* timer interval */
| ^~~~~~~~~~~
In file included from /usr/local/lib/R/library/progress/include/RProgress.h:6,
from Spinner.h:4,
from XlsWorkSheet.h:7,
from XlsWorkSheet.cpp:3:
/usr/include/unistd.h:487:8: note: forward declaration of 'struct timeval'
487 | struct timeval; /* select(2) */
| ^~~~~~~
In file included from /usr/local/lib/R/library/progress/include/RProgress.h:7,
from Spinner.h:4,
from XlsWorkSheet.h:7,
from XlsWorkSheet.cpp:3:
/usr/include/sys/time.h:390:17: error: field 'it_value' has incomplete type 'timeval'
390 | struct timeval it_value; /* current value */
| ^~~~~~~~
In file included from /usr/local/lib/R/library/progress/include/RProgress.h:6,
from Spinner.h:4,
from XlsWorkSheet.h:7,
from XlsWorkSheet.cpp:3:
/usr/include/unistd.h:487:8: note: forward declaration of 'struct timeval'
487 | struct timeval; /* select(2) */
| ^~~~~~~
In file included from /usr/local/lib/R/library/progress/include/RProgress.h:7,
from Spinner.h:4,
from XlsWorkSheet.h:7,
from XlsWorkSheet.cpp:3:
/usr/include/sys/time.h:552:26: error: 'id_t' was not declared in this scope; did you mean 'xls::id_t'?
552 | int clock_getcpuclockid2(id_t, int, clockid_t *);
| ^~~~
| xls::id_t
In file included from ./libxls/xlstypes.h:40,
from ./libxls/xls.h:42,
from ColSpec.h:5,
from XlsWorkSheet.cpp:2:
/usr/include/sys/types.h:140:17: note: 'xls::id_t' declared here
140 | typedef __id_t id_t; /* can hold a uid_t or pid_t */
| ^~~~
In file included from /usr/local/lib/R/library/progress/include/RProgress.h:7,
from Spinner.h:4,
from XlsWorkSheet.h:7,
from XlsWorkSheet.cpp:3:
/usr/include/sys/time.h:552:32: error: expected primary-expression before 'int'
552 | int clock_getcpuclockid2(id_t, int, clockid_t *);
| ^~~
/usr/include/sys/time.h:552:47: error: expected primary-expression before '*' token
552 | int clock_getcpuclockid2(id_t, int, clockid_t *);
| ^
/usr/include/sys/time.h:552:48: error: expected primary-expression before ')' token
552 | int clock_getcpuclockid2(id_t, int, clockid_t *);
| ^
/usr/include/sys/time.h:552:48: error: expression list treated as compound expression in initializer [-fpermissive]
In file included from Spinner.h:4,
from XlsWorkSheet.h:7,
from XlsWorkSheet.cpp:3:
/usr/local/lib/R/library/progress/include/RProgress.h: In static member function 'static double RProgress::RProgress::time_now()':
/usr/local/lib/R/library/progress/include/RProgress.h:349:20: error: aggregate 'timeval now' has incomplete type and cannot be defined
349 | struct timeval now;
| ^~~
gmake[1]: *** [/usr/local/lib/R/etc/Makeconf:174: XlsWorkSheet.o] Error 1
gmake[1]: Leaving directory '/wrkdirs/usr/ports/textproc/R-cran-readxl/work/readxl/src'
ERROR: compilation failed for package 'readxl'
* removing '/wrkdirs/usr/ports/textproc/R-cran-readxl/work/stage/usr/local/lib/R/library/readxl'
*** Error code 1
Stop.
make: stopped in /usr/ports/textproc/R-cran-readxl
More information about the freebsd-pkg-fallout
mailing list