Test failures in openjdk8

Brian Gardner openjdk at getsnappy.com
Wed Dec 10 07:27:24 UTC 2014


I believe that is normal, I recall getting something similar.

Brian Gardner

> On Dec 8, 2014, at 11:05 AM, Mikhail T. <mi+thun at aldan.algebra.com> wrote:
> 
> Hello!
> 
> Is it normal, that some OpenJDK's self-tests fail for me? Here is the end of the
> build-log -- with self-testing enabled. Should these be tightened up (fixed,
> where the problems are real, or disabled, where they aren't)? Please, advise.
> Thank you!
> 
>    -mi
> 
> ...
> Test results: passed: 3,416; failed: 10; error: 13
> Report written to
> /home/ports/java/openjdk8/work/openjdk/build/bsd-x86_64-normal-server-release/testoutput/jdk_core/JTreport/html/report.html
> Results written to
> /home/ports/java/openjdk8/work/openjdk/build/bsd-x86_64-normal-server-release/testoutput/jdk_core/JTwork
> Error: Some tests failed or other problems occurred.
> Summary: jdk_core
> FAILED: com/sun/corba/cachedSocket/7056731.sh
> FAILED: java/io/BufferedInputStream/LargeCopyWithMark.java
> FAILED: java/lang/ClassLoader/Assert.java
> FAILED: java/lang/ProcessBuilder/DestroyTest.java
> FAILED: java/lang/invoke/MethodHandles/CatchExceptionTest.java
> FAILED: java/lang/invoke/lambda/LogGeneratedClassesTest.java
> FAILED: java/net/Inet4Address/PingThis.java
> FAILED: java/net/ServerSocket/AcceptCauseFileDescriptorLeak.sh
> FAILED: java/net/Socket/SetSoLinger.java
> FAILED: java/net/URLClassLoader/closetest/CloseTest.java
> FAILED: java/net/URLClassLoader/closetest/GetResourceAsStream.java
> FAILED: java/net/URLPermission/nstest/lookup.sh
> FAILED: java/nio/MappedByteBuffer/Truncate.java
> FAILED: java/nio/channels/AsyncCloseAndInterrupt.java
> FAILED: java/nio/channels/DatagramChannel/MulticastSendReceiveTests.java
> FAILED: java/nio/channels/Selector/LotsOfChannels.java
> FAILED: java/nio/channels/SocketChannel/Shutdown.java
> FAILED: java/util/zip/ZipFile/MultiThreadedReadTest.java
> FAILED: javax/xml/jaxp/parsers/8032909/XSLT.java
> FAILED: javax/xml/ws/8043129/MailTest.java
> FAILED: sun/misc/CopyMemory.java
> FAILED: sun/reflect/AnonymousNewInstance/ManyNewInstanceAnonTest.java
> FAILED: sun/tools/native2ascii/NativeErrors.java
> TEST STATS: name=jdk_core  run=3439  pass=3416  fail=23
> 
> _______________________________________________
> freebsd-java at freebsd.org mailing list
> http://lists.freebsd.org/mailman/listinfo/freebsd-java
> To unsubscribe, send any mail to "freebsd-java-unsubscribe at freebsd.org"



More information about the freebsd-java mailing list