[package - 101i386-default][databases/libgda5] Failed for libgda5-5.2.4 in build
pkg-fallout at FreeBSD.org
pkg-fallout at FreeBSD.org
Tue Aug 30 03:09:25 UTC 2016
You are receiving this mail as a port that you maintain
is failing to build on the FreeBSD package build server.
Please investigate the failure and submit a PR to fix
build.
Maintainer: gnome at FreeBSD.org
Last committer: mat at FreeBSD.org
Ident: $FreeBSD: head/databases/libgda5/Makefile 419843 2016-08-08 13:46:50Z mat $
Log URL: http://beefy5.nyi.freebsd.org/data/101i386-default/421100/logs/libgda5-5.2.4.log
Build URL: http://beefy5.nyi.freebsd.org/build.html?mastername=101i386-default&build=421100
Log:
====>> Building databases/libgda5
build started at Tue Aug 30 03:08:19 UTC 2016
port directory: /usr/ports/databases/libgda5
building for: FreeBSD 101i386-default-job-24 10.1-RELEASE-p37 FreeBSD 10.1-RELEASE-p37 i386
maintained by: gnome at FreeBSD.org
Makefile ident: $FreeBSD: head/databases/libgda5/Makefile 419843 2016-08-08 13:46:50Z mat $
Poudriere version: 3.1.14
Host OSVERSION: 1200005
Jail OSVERSION: 1001000
---Begin Environment---
SHELL=/bin/csh
UNAME_p=i386
UNAME_m=i386
UNAME_v=FreeBSD 10.1-RELEASE-p37
UNAME_r=10.1-RELEASE-p37
BLOCKSIZE=K
MAIL=/var/mail/root
STATUS=1
OPSYS=FreeBSD
ARCH=i386
LINUX_OSRELEASE=2.6.32
SAVED_TERM=
MASTERMNT=/usr/local/poudriere/data/.m/101i386-default/ref
UID=0
PATH=/sbin:/bin:/usr/sbin:/usr/bin:/usr/games:/usr/local/sbin:/usr/local/bin:/root/bin
_JAVA_VERSION_LIST_REGEXP=1.6\|1.7\|1.8\|1.6+\|1.7+\|1.8+
POUDRIERE_BUILD_TYPE=bulk
PKGNAME=libgda5-5.2.4
OSREL=10.1
_OSRELEASE=10.1-RELEASE-p37
PYTHONBASE=/usr/local
OLDPWD=/
_SMP_CPUS=24
PWD=/usr/local/poudriere/data/.m/101i386-default/ref/.p/pool
MASTERNAME=101i386-default
SCRIPTPREFIX=/usr/local/share/poudriere
_JAVA_VENDOR_LIST_REGEXP=openjdk\|oracle\|sun
USER=root
HOME=/root
POUDRIERE_VERSION=3.1.14
SCRIPTPATH=/usr/local/share/poudriere/bulk.sh
CONFIGURE_MAX_CMD_LEN=262144
LIBEXECPREFIX=/usr/local/libexec/poudriere
LOCALBASE=/usr/local
PACKAGE_BUILDING=yes
_JAVA_OS_LIST_REGEXP=native\|linux
OSVERSION=1001000
---End Environment---
---Begin OPTIONS List---
---End OPTIONS List---
--CONFIGURE_ARGS--
--without-oracle --disable-crypto --disable-default-binary --enable-introspection --without-ui --without-bdb --without-ldap --without-mysql --without-postgres --without-mdb --without-java --prefix=/usr/local ${_LATE_CONFIGURE_ARGS}
--End CONFIGURE_ARGS--
--CONFIGURE_ENV--
MAKE=gmake PKG_CONFIG=pkgconf XDG_DATA_HOME=/wrkdirs/usr/ports/databases/libgda5/work XDG_CONFIG_HOME=/wrkdirs/usr/ports/databases/libgda5/work HOME=/wrkdirs/usr/ports/databases/libgda5/work TMPDIR="/tmp" SHELL=/bin/sh CONFIG_SHELL=/bin/sh CONFIG_SITE=/usr/ports/Templates/config.site lt_cv_sys_max_cmd_len=262144
--End CONFIGURE_ENV--
--MAKE_ENV--
XDG_DATA_HOME=/wrkdirs/usr/ports/databases/libgda5/work XDG_CONFIG_HOME=/wrkdirs/usr/ports/databases/libgda5/work HOME=/wrkdirs/usr/ports/databases/libgda5/work TMPDIR="/tmp" NO_PIE=yes WITHOUT_DEBUG_FILES=yes WITHOUT_KERNEL_SYMBOLS=yes SHELL=/bin/sh NO_LINT=YES PREFIX=/usr/local LOCALBASE=/usr/local LIBDIR="/usr/lib" CC="cc" CFLAGS="-O2 -pipe -fstack-protector -fno-strict-aliasing" CPP="cpp" CPPFLAGS="-I/usr/local/include" LDFLAGS=" -fstack-protector" LIBS="-L/usr/local/lib" CXX="c++" CXXFLAGS="-O2 -pipe -fstack-protector -fno-strict-aliasing " MANPREFIX="/usr/local" BSD_INSTALL_PROGRAM="install -s -m 555" BSD_INSTALL_LIB="install -s -m 444" BSD_INSTALL_SCRIPT="install -m 555" BSD_INSTALL_DATA="install -m 0644" BSD_INSTALL_MAN="install -m 444"
--End MAKE_ENV--
--PLIST_SUB--
VERSION=5.0
GTK2_VERSION="2.10.0"
GTK3_VERSION="3.0.0"
OSREL=10.1
PREFIX=%D
LOCALBASE=/usr/local
RESETPREFIX=/usr/local
PORTDOCS=""
PORTEXAMPLES=""
LIB32DIR=lib
DOCSDIR="share/doc/libgda"
EXAMPLESDIR="share/examples/libgda"
DATADIR="share/libgda"
WWWDIR="www/libgda"
ETCDIR="etc/libgda"
--End PLIST_SUB--
--SUB_LIST--
PREFIX=/usr/local
LOCALBASE=/usr/local
DATADIR=/usr/local/share/libgda
DOCSDIR=/usr/local/share/doc/libgda
EXAMPLESDIR=/usr/local/share/examples/libgda
WWWDIR=/usr/local/www/libgda
ETCDIR=/usr/local/etc/libgda
--End SUB_LIST--
---Begin make.conf---
MACHINE=i386
MACHINE_ARCH=i386
ARCH=${MACHINE_ARCH}
USE_PACKAGE_DEPENDS=yes
BATCH=yes
WRKDIRPREFIX=/wrkdirs
PORTSDIR=/usr/ports
PACKAGES=/packages
DISTDIR=/distfiles
#### /usr/local/etc/poudriere.d/make.conf ####
# XXX: We really need this but cannot use it while 'make checksum' does not
# try the next mirror on checksum failure. It currently retries the same
# failed mirror and then fails rather then trying another. It *does*
# try the next if the size is mismatched though.
#MASTER_SITE_FREEBSD=yes
DISABLE_MAKE_JOBS=poudriere
---End make.conf---
=======================<phase: check-sanity >============================
===========================================================================
=======================<phase: pkg-depends >============================
===> libgda5-5.2.4 depends on file: /usr/local/sbin/pkg - not found
===> Installing existing package /packages/All/pkg-1.8.7_1.txz
[101i386-default-job-24] Installing pkg-1.8.7_1...
[101i386-default-job-24] Extracting pkg-1.8.7_1: .......... done
===> libgda5-5.2.4 depends on file: /usr/local/sbin/pkg - found
===> Returning to build of libgda5-5.2.4
===========================================================================
=======================<phase: fetch-depends >============================
===========================================================================
=======================<phase: fetch >============================
===> Fetching all distfiles required by libgda5-5.2.4 for building
===========================================================================
=======================<phase: checksum >============================
===> Fetching all distfiles required by libgda5-5.2.4 for building
=> SHA256 Checksum OK for gnome3/libgda-5.2.4.tar.xz.
===========================================================================
=======================<phase: extract-depends>============================
===========================================================================
=======================<phase: extract >============================
===> Fetching all distfiles required by libgda5-5.2.4 for building
===> Extracting for libgda5-5.2.4
=> SHA256 Checksum OK for gnome3/libgda-5.2.4.tar.xz.
===========================================================================
=======================<phase: patch-depends >============================
===========================================================================
=======================<phase: patch >============================
===> Patching for libgda5-5.2.4
===========================================================================
=======================<phase: build-depends >============================
===> libgda5-5.2.4 depends on executable: itstool - not found
===> Installing existing package /packages/All/itstool-2.0.2_1.txz
[101i386-default-job-24] Installing itstool-2.0.2_1...
[101i386-default-job-24] `-- Installing python27-2.7.12...
[101i386-default-job-24] | `-- Installing libffi-3.2.1...
[101i386-default-job-24] | | `-- Installing indexinfo-0.2.4...
[101i386-default-job-24] | | `-- Extracting indexinfo-0.2.4: .... done
[101i386-default-job-24] | `-- Extracting libffi-3.2.1: .......... done
[101i386-default-job-24] | `-- Installing gettext-runtime-0.19.8.1...
[101i386-default-job-24] | `-- Extracting gettext-runtime-0.19.8.1: .......... done
[101i386-default-job-24] `-- Extracting python27-2.7.12: .......... done
[101i386-default-job-24] `-- Installing py27-libxml2-2.9.4...
[101i386-default-job-24] | `-- Installing libxml2-2.9.4...
[101i386-default-job-24] | `-- Extracting libxml2-2.9.4: .......... done
[101i386-default-job-24] | `-- Installing py27-setuptools27-23.1.0...
[101i386-default-job-24] | `-- Extracting py27-setuptools27-23.1.0: .......... done
[101i386-default-job-24] | `-- Installing python2-2_3...
[101i386-default-job-24] | `-- Extracting python2-2_3: ...... done
[101i386-default-job-24] `-- Extracting py27-libxml2-2.9.4: .......... done
[101i386-default-job-24] Extracting itstool-2.0.2_1: .......... done
Message from python27-2.7.12:
===========================================================================
Note that some standard Python modules are provided as separate ports
as they require additional dependencies. They are available as:
bsddb databases/py-bsddb
gdbm databases/py-gdbm
sqlite3 databases/py-sqlite3
tkinter x11-toolkits/py-tkinter
===========================================================================
===> libgda5-5.2.4 depends on executable: itstool - found
===> Returning to build of libgda5-5.2.4
===> libgda5-5.2.4 depends on executable: msgfmt - not found
===> Installing existing package /packages/All/gettext-tools-0.19.8.1.txz
[101i386-default-job-24] Installing gettext-tools-0.19.8.1...
[101i386-default-job-24] Extracting gettext-tools-0.19.8.1: .......... done
===> libgda5-5.2.4 depends on executable: msgfmt - found
===> Returning to build of libgda5-5.2.4
===> libgda5-5.2.4 depends on executable: gmake - not found
===> Installing existing package /packages/All/gmake-4.2.1_1.txz
[101i386-default-job-24] Installing gmake-4.2.1_1...
[101i386-default-job-24] Extracting gmake-4.2.1_1: .......... done
===> libgda5-5.2.4 depends on executable: gmake - found
===> Returning to build of libgda5-5.2.4
===> libgda5-5.2.4 depends on package: pkgconf>=0.9.10 - not found
===> Installing existing package /packages/All/pkgconf-1.0.1.txz
[101i386-default-job-24] Installing pkgconf-1.0.1...
[101i386-default-job-24] Extracting pkgconf-1.0.1: .......... done
===> libgda5-5.2.4 depends on package: pkgconf>=0.9.10 - found
===> Returning to build of libgda5-5.2.4
===> libgda5-5.2.4 depends on file: /usr/local/bin/intltool-extract - not found
===> Installing existing package /packages/All/intltool-0.51.0_1.txz
[101i386-default-job-24] Installing intltool-0.51.0_1...
[101i386-default-job-24] `-- Installing p5-XML-Parser-2.44...
<snip>
^
In file included from gda-vprovider-data-model.c:32:
In file included from ./../gda-sqlite.h:48:
./../../libgda/sqlite/sqlite-src/sqlite3.h:5179:35: warning: redefinition of typedef 'sqlite3_index_info' is a C11 feature [-Wtypedef-redefinition]
typedef struct sqlite3_index_info sqlite3_index_info;
^
/usr/local/include/sqlite3.h:5756:35: note: previous definition is here
typedef struct sqlite3_index_info sqlite3_index_info;
^
In file included from gda-vprovider-data-model.c:32:
In file included from ./../gda-sqlite.h:48:
./../../libgda/sqlite/sqlite-src/sqlite3.h:5180:36: warning: redefinition of typedef 'sqlite3_vtab_cursor' is a C11 feature [-Wtypedef-redefinition]
typedef struct sqlite3_vtab_cursor sqlite3_vtab_cursor;
^
/usr/local/include/sqlite3.h:5757:36: note: previous definition is here
typedef struct sqlite3_vtab_cursor sqlite3_vtab_cursor;
^
In file included from gda-vprovider-data-model.c:32:
In file included from ./../gda-sqlite.h:48:
./../../libgda/sqlite/sqlite-src/sqlite3.h:5181:31: warning: redefinition of typedef 'sqlite3_module' is a C11 feature [-Wtypedef-redefinition]
typedef struct sqlite3_module sqlite3_module;
^
/usr/local/include/sqlite3.h:5758:31: note: previous definition is here
typedef struct sqlite3_module sqlite3_module;
^
In file included from gda-vprovider-data-model.c:32:
In file included from ./../gda-sqlite.h:48:
./../../libgda/sqlite/sqlite-src/sqlite3.h:5199:8: error: redefinition of 'sqlite3_module'
struct sqlite3_module {
^
/usr/local/include/sqlite3.h:5776:8: note: previous definition is here
struct sqlite3_module {
^
In file included from gda-vprovider-data-model.c:32:
In file included from ./../gda-sqlite.h:48:
./../../libgda/sqlite/sqlite-src/sqlite3.h:5287:8: error: redefinition of 'sqlite3_index_info'
struct sqlite3_index_info {
^
/usr/local/include/sqlite3.h:5905:8: note: previous definition is here
struct sqlite3_index_info {
^
In file included from gda-vprovider-data-model.c:32:
In file included from ./../gda-sqlite.h:48:
./../../libgda/sqlite/sqlite-src/sqlite3.h:5290:10: error: redefinition of 'sqlite3_index_constraint'
struct sqlite3_index_constraint {
^
/usr/local/include/sqlite3.h:5908:10: note: previous definition is here
struct sqlite3_index_constraint {
^
In file included from gda-vprovider-data-model.c:32:
In file included from ./../gda-sqlite.h:48:
./../../libgda/sqlite/sqlite-src/sqlite3.h:5297:10: error: redefinition of 'sqlite3_index_orderby'
struct sqlite3_index_orderby {
^
/usr/local/include/sqlite3.h:5915:10: note: previous definition is here
struct sqlite3_index_orderby {
^
In file included from gda-vprovider-data-model.c:32:
In file included from ./../gda-sqlite.h:48:
./../../libgda/sqlite/sqlite-src/sqlite3.h:5302:10: error: redefinition of 'sqlite3_index_constraint_usage'
struct sqlite3_index_constraint_usage {
^
/usr/local/include/sqlite3.h:5920:10: note: previous definition is here
struct sqlite3_index_constraint_usage {
^
In file included from gda-vprovider-data-model.c:32:
In file included from ./../gda-sqlite.h:48:
./../../libgda/sqlite/sqlite-src/sqlite3.h:5385:8: error: redefinition of 'sqlite3_vtab'
struct sqlite3_vtab {
^
/usr/local/include/sqlite3.h:6018:8: note: previous definition is here
struct sqlite3_vtab {
^
In file included from gda-vprovider-data-model.c:32:
In file included from ./../gda-sqlite.h:48:
./../../libgda/sqlite/sqlite-src/sqlite3.h:5409:8: error: redefinition of 'sqlite3_vtab_cursor'
struct sqlite3_vtab_cursor {
^
/usr/local/include/sqlite3.h:6042:8: note: previous definition is here
struct sqlite3_vtab_cursor {
^
In file included from gda-vprovider-data-model.c:32:
In file included from ./../gda-sqlite.h:48:
./../../libgda/sqlite/sqlite-src/sqlite3.h:5464:29: warning: redefinition of typedef 'sqlite3_blob' is a C11 feature [-Wtypedef-redefinition]
typedef struct sqlite3_blob sqlite3_blob;
^
/usr/local/include/sqlite3.h:6098:29: note: previous definition is here
typedef struct sqlite3_blob sqlite3_blob;
^
In file included from gda-vprovider-data-model.c:32:
In file included from ./../gda-sqlite.h:48:
./../../libgda/sqlite/sqlite-src/sqlite3.h:5878:38: warning: redefinition of typedef 'sqlite3_mutex_methods' is a C11 feature [-Wtypedef-redefinition]
typedef struct sqlite3_mutex_methods sqlite3_mutex_methods;
^
/usr/local/include/sqlite3.h:6536:38: note: previous definition is here
typedef struct sqlite3_mutex_methods sqlite3_mutex_methods;
^
In file included from gda-vprovider-data-model.c:32:
In file included from ./../gda-sqlite.h:48:
./../../libgda/sqlite/sqlite-src/sqlite3.h:5879:8: error: redefinition of 'sqlite3_mutex_methods'
struct sqlite3_mutex_methods {
^
/usr/local/include/sqlite3.h:6537:8: note: previous definition is here
struct sqlite3_mutex_methods {
^
In file included from gda-vprovider-data-model.c:32:
In file included from ./../gda-sqlite.h:48:
./../../libgda/sqlite/sqlite-src/sqlite3.h:6037:9: warning: 'SQLITE_TESTCTRL_LAST' macro redefined
#define SQLITE_TESTCTRL_LAST 19
^
/usr/local/include/sqlite3.h:6709:9: note: previous definition is here
#define SQLITE_TESTCTRL_LAST 25
^
In file included from gda-vprovider-data-model.c:32:
In file included from ./../gda-sqlite.h:48:
./../../libgda/sqlite/sqlite-src/sqlite3.h:6289:9: warning: 'SQLITE_DBSTATUS_MAX' macro redefined
#define SQLITE_DBSTATUS_MAX 10 /* Largest defined DBSTATUS */
^
/usr/local/include/sqlite3.h:6979:9: note: previous definition is here
#define SQLITE_DBSTATUS_MAX 11 /* Largest defined DBSTATUS */
^
In file included from gda-vprovider-data-model.c:32:
In file included from ./../gda-sqlite.h:48:
./../../libgda/sqlite/sqlite-src/sqlite3.h:6370:31: warning: redefinition of typedef 'sqlite3_pcache' is a C11 feature [-Wtypedef-redefinition]
typedef struct sqlite3_pcache sqlite3_pcache;
^
/usr/local/include/sqlite3.h:7061:31: note: previous definition is here
typedef struct sqlite3_pcache sqlite3_pcache;
^
In file included from gda-vprovider-data-model.c:32:
In file included from ./../gda-sqlite.h:48:
./../../libgda/sqlite/sqlite-src/sqlite3.h:6382:36: warning: redefinition of typedef 'sqlite3_pcache_page' is a C11 feature [-Wtypedef-redefinition]
typedef struct sqlite3_pcache_page sqlite3_pcache_page;
^
/usr/local/include/sqlite3.h:7073:36: note: previous definition is here
typedef struct sqlite3_pcache_page sqlite3_pcache_page;
^
In file included from gda-vprovider-data-model.c:32:
In file included from ./../gda-sqlite.h:48:
./../../libgda/sqlite/sqlite-src/sqlite3.h:6383:8: error: redefinition of 'sqlite3_pcache_page'
struct sqlite3_pcache_page {
^
/usr/local/include/sqlite3.h:7074:8: note: previous definition is here
struct sqlite3_pcache_page {
^
In file included from gda-vprovider-data-model.c:32:
In file included from ./../gda-sqlite.h:48:
./../../libgda/sqlite/sqlite-src/sqlite3.h:6547:40: warning: redefinition of typedef 'sqlite3_pcache_methods2' is a C11 feature [-Wtypedef-redefinition]
typedef struct sqlite3_pcache_methods2 sqlite3_pcache_methods2;
^
/usr/local/include/sqlite3.h:7238:40: note: previous definition is here
typedef struct sqlite3_pcache_methods2 sqlite3_pcache_methods2;
^
In file included from gda-vprovider-data-model.c:32:
In file included from ./../gda-sqlite.h:48:
./../../libgda/sqlite/sqlite-src/sqlite3.h:6548:8: error: redefinition of 'sqlite3_pcache_methods2'
struct sqlite3_pcache_methods2 {
^
/usr/local/include/sqlite3.h:7239:8: note: previous definition is here
struct sqlite3_pcache_methods2 {
^
In file included from gda-vprovider-data-model.c:32:
In file included from ./../gda-sqlite.h:48:
./../../libgda/sqlite/sqlite-src/sqlite3.h:6570:39: warning: redefinition of typedef 'sqlite3_pcache_methods' is a C11 feature [-Wtypedef-redefinition]
typedef struct sqlite3_pcache_methods sqlite3_pcache_methods;
^
/usr/local/include/sqlite3.h:7261:39: note: previous definition is here
typedef struct sqlite3_pcache_methods sqlite3_pcache_methods;
^
In file included from gda-vprovider-data-model.c:32:
In file included from ./../gda-sqlite.h:48:
./../../libgda/sqlite/sqlite-src/sqlite3.h:6571:8: error: redefinition of 'sqlite3_pcache_methods'
struct sqlite3_pcache_methods {
^
/usr/local/include/sqlite3.h:7262:8: note: previous definition is here
struct sqlite3_pcache_methods {
^
In file included from gda-vprovider-data-model.c:32:
In file included from ./../gda-sqlite.h:48:
./../../libgda/sqlite/sqlite-src/sqlite3.h:6596:31: warning: redefinition of typedef 'sqlite3_backup' is a C11 feature [-Wtypedef-redefinition]
typedef struct sqlite3_backup sqlite3_backup;
^
/usr/local/include/sqlite3.h:7287:31: note: previous definition is here
typedef struct sqlite3_backup sqlite3_backup;
^
33 warnings and 15 errors generated.
gmake[5]: *** [Makefile:639: gda-vprovider-data-model.lo] Error 1
gmake[5]: Leaving directory '/wrkdirs/usr/ports/databases/libgda5/work/libgda-5.2.4/libgda/sqlite/virtual'
gmake[4]: *** [Makefile:1012: all-recursive] Error 1
gmake[4]: Leaving directory '/wrkdirs/usr/ports/databases/libgda5/work/libgda-5.2.4/libgda/sqlite'
gmake[3]: *** [Makefile:655: all] Error 2
gmake[3]: Leaving directory '/wrkdirs/usr/ports/databases/libgda5/work/libgda-5.2.4/libgda/sqlite'
gmake[2]: *** [Makefile:1222: all-recursive] Error 1
gmake[2]: Leaving directory '/wrkdirs/usr/ports/databases/libgda5/work/libgda-5.2.4/libgda'
gmake[1]: *** [Makefile:734: all-recursive] Error 1
gmake[1]: Leaving directory '/wrkdirs/usr/ports/databases/libgda5/work/libgda-5.2.4'
*** Error code 1
Stop.
make: stopped in /usr/ports/databases/libgda5
More information about the freebsd-gnome
mailing list