textproc/aspell (0.50.3-1) has been failed with GCC 3.3.1..

Jeremy Messenger mezz7 at cox.net
Thu Jul 17 11:22:25 PDT 2003


Here's info:
=========================
checker_string.cpp: In member function `void 
CheckerString::replace(acommon::ParmString)':
checker_string.cpp:113: error: `assert' undeclared (first use this 
function)
checker_string.cpp:113: error: (Each undeclared identifier is reported only 
once for each function it appears in.)
gmake[1]: *** [checker_string.o] Error 1
gmake[1]: Leaving directory `/usr/ports/textproc/aspell/work/aspell- 
0.50.3/prog'
gmake: *** [all-recursive] Error 1
*** Error code 2

Stop in /usr/ports/textproc/aspell.
*** Error code 1
=========================

I started with empty /usr/local/ and /usr/X11R6/ to build gnome2 right now 
with yesterday -CURRENT..

Cheers,
Mezz


-- 
bsdforums.org 's moderator, mezz.


More information about the freebsd-gnome mailing list