[package - head-amd64-default][www/seamonkey] Failed for seamonkey-2.46_10 in stage
pkg-fallout at FreeBSD.org
pkg-fallout at FreeBSD.org
Tue Jun 20 23:23:32 UTC 2017
You are receiving this mail as a port that you maintain
is failing to build on the FreeBSD package build server.
Please investigate the failure and submit a PR to fix
build.
Maintainer: gecko at FreeBSD.org
Last committer: rezny at FreeBSD.org
Ident: $FreeBSD: head/www/seamonkey/Makefile 441503 2017-05-23 05:03:14Z rezny $
Log URL: http://beefy12.nyi.freebsd.org/data/head-amd64-default/p443918_s320126/logs/seamonkey-2.46_10.log
Build URL: http://beefy12.nyi.freebsd.org/build.html?mastername=head-amd64-default&build=p443918_s320126
Log:
====>> Building www/seamonkey
build started at Tue Jun 20 19:35:24 UTC 2017
port directory: /usr/ports/www/seamonkey
building for: FreeBSD head-amd64-default-job-21 12.0-CURRENT FreeBSD 12.0-CURRENT 1200034 amd64
maintained by: gecko at FreeBSD.org
Makefile ident: $FreeBSD: head/www/seamonkey/Makefile 441503 2017-05-23 05:03:14Z rezny $
Poudriere version: 3.1.19-29-g5598cc27
Host OSVERSION: 1200031
Jail OSVERSION: 1200034
Job Id: 21
!!! Jail is newer than host. (Jail: 1200034, Host: 1200031) !!!
!!! This is not supported. !!!
!!! Host kernel must be same or newer than jail. !!!
!!! Expect build failures. !!!
---Begin Environment---
SHELL=/bin/csh
OSVERSION=1200034
UNAME_v=FreeBSD 12.0-CURRENT 1200034
UNAME_r=12.0-CURRENT
BLOCKSIZE=K
MAIL=/var/mail/root
STATUS=1
SAVED_TERM=
MASTERMNT=/usr/local/poudriere/data/.m/head-amd64-default/ref
PATH=/sbin:/bin:/usr/sbin:/usr/bin:/usr/local/sbin:/usr/local/bin:/root/bin
POUDRIERE_BUILD_TYPE=bulk
PKGNAME=seamonkey-2.46_10
OLDPWD=/
PWD=/usr/local/poudriere/data/.m/head-amd64-default/ref/.p/pool
MASTERNAME=head-amd64-default
SCRIPTPREFIX=/usr/local/share/poudriere
USER=root
HOME=/root
POUDRIERE_VERSION=3.1.19-29-g5598cc27
SCRIPTPATH=/usr/local/share/poudriere/bulk.sh
LIBEXECPREFIX=/usr/local/libexec/poudriere
LOCALBASE=/usr/local
POUDRIEREPATH=/usr/local/bin/poudriere
---End Environment---
---Begin Poudriere Port Flags/Env---
PORT_FLAGS=
PKGENV=
---End Poudriere Port Flags/Env---
---Begin OPTIONS List---
===> The following configuration options are available for seamonkey-2.46_10:
BUNDLED_CAIRO=off: Use bundled fork of cairo-1.9.5
CANBERRA=on: Sound theme alerts
DBUS=on: D-Bus IPC system support
DEBUG=off: Build with debugging support
DTRACE=on: Build with DTrace probes
FFMPEG=on: FFmpeg support (WMA, AIFF, AC3, APE...)
GCONF=off: GConf configuration backend support
GNOMEUI=off: libgnomeui support module
INTEGER_SAMPLES=off: Integer audio sample format
LDAP=on: LDAP support for Mailnews
LIBPROXY=off: Proxy support via libproxy
LIGHTNING=on: Calendar extension
OPTIMIZED_CFLAGS=on: Use extra compiler optimizations
PGO=off: Use Profile-Guided Optimization
PROFILE=off: Build with profiling support
RUST=off: Build with components written in Rust language
TEST=off: Build and/or run tests
====> Options available for the multi AUDIO: you have to choose at least one of them
ALSA=on: ALSA audio architecture support
PULSEAUDIO=on: PulseAudio sound server support
SNDIO=off: Sndio audio support
====> Options available for the single TOOLKIT: you have to select exactly one of them
GTK2=on: GTK+ 2 GUI toolkit support
GTK3=off: GTK+ 3 GUI toolkit support
===> Use 'make config' to modify these settings
---End OPTIONS List---
--CONFIGURE_ARGS--
--End CONFIGURE_ARGS--
--CONFIGURE_ENV--
MAKE=gmake ac_cv_path_PERL=/usr/local/bin/perl ac_cv_path_PERL_PATH=/usr/local/bin/perl PERL_USE_UNSAFE_INC=1 PKG_CONFIG=pkgconf PYTHON="/usr/local/bin/python2.7" XDG_DATA_HOME=/wrkdirs/usr/ports/www/seamonkey/work XDG_CONFIG_HOME=/wrkdirs/usr/ports/www/seamonkey/work HOME=/wrkdirs/usr/ports/www/seamonkey/work TMPDIR="/tmp" SHELL=/bin/sh CONFIG_SHELL=/bin/sh CMAKE_PREFIX_PATH="/usr/local"
--End CONFIGURE_ENV--
--MAKE_ENV--
PERL_USE_UNSAFE_INC=1 XDG_DATA_HOME=/wrkdirs/usr/ports/www/seamonkey/work XDG_CONFIG_HOME=/wrkdirs/usr/ports/www/seamonkey/work HOME=/wrkdirs/usr/ports/www/seamonkey/work TMPDIR="/tmp" NO_PIE=yes MK_DEBUG_FILES=no MK_KERNEL_SYMBOLS=no SHELL=/bin/sh NO_LINT=YES PREFIX=/usr/local LOCALBASE=/usr/local LIBDIR="/usr/lib" CC="cc" CFLAGS="-O2 -pipe -O3 -DLIBICONV_PLUG -isystem /usr/local/include -fno-strict-aliasing" CPP="cpp" CPPFLAGS="-D_GLIBCXX_USE_C99 -D_GLIBCXX_USE_C99_MATH_TR1 -D_DECLARE_C99_LDBL_MATH -DLIBICONV_PLUG -isystem /usr/local/include" LDFLAGS=" -Wl,--as-needed" LIBS="-L/usr/local/lib" CXX="c++" CXXFLAGS="-O2 -pipe -O3 -DLIBICONV_PLUG -isystem /usr/local/include -fno-strict-aliasing -DLIBICONV_PLUG -isystem /usr/local/include" MANPREFIX="/usr/local" BSD_INSTALL_PROGRAM="install -m 555" BSD_INSTALL_LIB="install -m 0644" BSD_INSTALL_SCRIPT="install -m 555" BSD_INSTALL_DATA="install -m 0644" BSD_INSTALL_MAN="install -m 444"
--End MAKE_ENV--
--PLIST_SUB--
PYTHON_INCLUDEDIR=include/python2.7
PYTHON_LIBDIR=lib/python2.7
PYTHON_PLATFORM=freebsd12
PYTHON_PYOEXTENSION=pyo
PYTHON_SITELIBDIR=lib/python2.7/site-packages
PYTHON_SUFFIX=27
PYTHON_VER=2.7
PYTHON_VERSION=python2.7
PYTHON2=""
PYTHON3="@comment
"
GTK2_VERSION="2.10.0"
GTK3_VERSION="3.0.0"
OSREL=12.0
PREFIX=%D
LOCALBASE=/usr/local
RESETPREFIX=/usr/local
PORTDOCS=""
PORTEXAMPLES=""
LIB32DIR=lib
PERL_VERSION=5.24.1
PERL_VER=5.24
PERL5_MAN1=lib/perl5/site_perl/man/man1
PERL5_MAN3=lib/perl5/site_perl/man/man3
SITE_PERL=lib/perl5/site_perl
SITE_ARCH=lib/perl5/site_perl/mach/5.24
DOCSDIR="share/doc/seamonkey"
EXAMPLESDIR="share/examples/seamonkey"
DATADIR="share/seamonkey"
WWWDIR="www/seamonkey"
ETCDIR="etc/seamonkey"
--End PLIST_SUB--
--SUB_LIST--
PREFIX=/usr/local
LOCALBASE=/usr/local
DATADIR=/usr/local/share/seamonkey
DOCSDIR=/usr/local/share/doc/seamonkey
EXAMPLESDIR=/usr/local/share/examples/seamonkey
WWWDIR=/usr/local/www/seamonkey
ETCDIR=/usr/local/etc/seamonkey
--End SUB_LIST--
---Begin make.conf---
USE_PACKAGE_DEPENDS=yes
BATCH=yes
WRKDIRPREFIX=/wrkdirs
PORTSDIR=/usr/ports
PACKAGES=/packages
DISTDIR=/distfiles
PACKAGE_BUILDING=yes
#### /usr/local/etc/poudriere.d/make.conf ####
# XXX: We really need this but cannot use it while 'make checksum' does not
# try the next mirror on checksum failure. It currently retries the same
# failed mirror and then fails rather then trying another. It *does*
# try the next if the size is mismatched though.
#MASTER_SITE_FREEBSD=yes
# Build ALLOW_MAKE_JOBS_PACKAGES with 2 jobs
MAKE_JOBS_NUMBER=2
#### /usr/ports/Mk/Scripts/ports_env.sh ####
ARCH=amd64
CONFIGURE_MAX_CMD_LEN=262144
HAVE_COMPAT_IA32_KERN=YES
OPSYS=FreeBSD
OSREL=12.0
OSVERSION=1200034
PYTHONBASE=/usr/local
UID=0
_JAVA_OS_LIST_REGEXP=native\|linux
_JAVA_VENDOR_LIST_REGEXP=openjdk\|oracle\|sun
_JAVA_VERSION_LIST_REGEXP=1.6\|1.7\|1.8\|1.6+\|1.7+\|1.8+
_OSRELEASE=12.0-CURRENT
#### Misc Poudriere ####
GID=0
DISABLE_MAKE_JOBS=poudriere
---End make.conf---
--Resource limits--
cpu time (seconds, -t) unlimited
file size (512-blocks, -f) unlimited
data seg size (kbytes, -d) 33554432
stack size (kbytes, -s) 524288
core file size (512-blocks, -c) unlimited
max memory size (kbytes, -m) unlimited
locked memory (kbytes, -l) unlimited
max user processes (-u) 89999
open files (-n) 1024
virtual mem size (kbytes, -v) unlimited
swap limit (kbytes, -w) unlimited
socket buffer size (bytes, -b) unlimited
pseudo-terminals (-p) unlimited
kqueues (-k) unlimited
umtx shared locks (-o) unlimited
--End resource limits--
=======================<phase: check-sanity >============================
===========================================================================
=======================<phase: pkg-depends >============================
===> seamonkey-2.46_10 depends on file: /usr/local/sbin/pkg - not found
===> Installing existing package /packages/All/pkg-1.10.1.txz
[head-amd64-default-job-21] Installing pkg-1.10.1...
[head-amd64-default-job-21] Extracting pkg-1.10.1: .......... done
===> seamonkey-2.46_10 depends on file: /usr/local/sbin/pkg - found
===> Returning to build of seamonkey-2.46_10
===========================================================================
=======================<phase: fetch-depends >============================
===========================================================================
<snip>
resource://gre/components/nsSidebar.js
resource://gre/components/nsSuiteDownloadManagerUI.js
resource://gre/components/nsSuiteGlue.js
resource://gre/components/nsTaggingService.js
resource://gre/components/nsTerminatorTelemetry.js
resource://gre/components/nsTypeAheadFind.js
resource://gre/components/nsURLFormatter.js
resource://gre/components/nsUpdateService.js
resource://gre/components/nsUpdateServiceStub.js
resource://gre/components/nsUpdateTimerManager.js
resource://gre/components/nsUrlClassifierHashCompleter.js
resource://gre/components/nsUrlClassifierLib.js
resource://gre/components/nsUrlClassifierListManager.js
resource://gre/components/nsWebHandlerApp.js
resource://gre/components/offlineStartup.js
resource://gre/components/recording-cmdline.js
resource://gre/components/simpleServices.js
resource://gre/components/smileApplication.js
resource://gre/components/smime-service.js
resource://gre/components/storage-json.js
resource://gre/components/txEXSLTRegExFunctions.js
resource://gre/components/webideCli.js
resource://gre/modules/ABQueryUtils.jsm
resource://gre/modules/AboutReader.jsm
resource://gre/modules/ActivitiesService.jsm
resource://gre/modules/ActivitiesServiceFilter.jsm
resource://gre/modules/AddonManager.jsm
resource://gre/modules/AddonWatcher.jsm
resource://gre/modules/AlarmDB.jsm
resource://gre/modules/AlarmService.jsm
resource://gre/modules/AppConstants.jsm
resource://gre/modules/AppDownloadManager.jsm
resource://gre/modules/AppsServiceChild.jsm
resource://gre/modules/AppsUtils.jsm
resource://gre/modules/AsyncPrefs.jsm
resource://gre/modules/AsyncShutdown.jsm
resource://gre/modules/AsyncSpellCheckTestHelper.jsm
resource://gre/modules/AutoCompleteE10S.jsm
resource://gre/modules/BackgroundPageThumbs.jsm
resource://gre/modules/Battery.jsm
resource://gre/modules/BinarySearch.jsm
resource://gre/modules/BookmarkHTMLUtils.jsm
resource://gre/modules/BookmarkJSONUtils.jsm
resource://gre/modules/Bookmarks.jsm
resource://gre/modules/BrowserElementPromptService.jsm
resource://gre/modules/BrowserUtils.jsm
resource://gre/modules/CanonicalJSON.jsm
resource://gre/modules/CertUtils.jsm
resource://gre/modules/CharsetMenu.jsm
resource://gre/modules/ChromeManifestParser.jsm
resource://gre/modules/ClientID.jsm
resource://gre/modules/CloudSync.jsm
resource://gre/modules/CloudSyncAdapters.jsm
resource://gre/modules/CloudSyncBookmarks.jsm
resource://gre/modules/CloudSyncBookmarksFolderCache.jsm
resource://gre/modules/CloudSyncEventSource.jsm
resource://gre/modules/CloudSyncLocal.jsm
resource://gre/modules/CloudSyncPlacesWrapper.jsm
resource://gre/modules/CloudSyncTabs.jsm
resource://gre/modules/ClusterLib.js
resource://gre/modules/ColorAnalyzer_worker.js
resource://gre/modules/ColorConversion.js
resource://gre/modules/CommonDialog.jsm
resource://gre/modules/CompatWarning.jsm
resource://gre/modules/Console.jsm
resource://gre/modules/ContactDB.jsm
resource://gre/modules/ContactService.jsm
resource://gre/modules/ContentPrefInstance.jsm
resource://gre/modules/ContentPrefService2.jsm
resource://gre/modules/ContentPrefServiceChild.jsm
resource://gre/modules/ContentPrefServiceParent.jsm
resource://gre/modules/ContentPrefStore.jsm
resource://gre/modules/ContentPrefUtils.jsm
resource://gre/modules/CrashMonitor.jsm
resource://gre/modules/Credentials.jsm
resource://gre/modules/DNSPacket.jsm
resource://gre/modules/DNSRecord.jsm
resource://gre/modules/DNSResourceRecord.jsm
resource://gre/modules/DNSTypes.jsm
resource://gre/modules/DOMRequestHelper.jsm
resource://gre/modules/DataReader.jsm
resource://gre/modules/DataWriter.jsm
resource://gre/modules/DeferredSave.jsm
resource://gre/modules/DeferredTask.jsm
resource://gre/modules/Deprecated.jsm
resource://gre/modules/DownloadCore.jsm
resource://gre/modules/DownloadImport.jsm
resource://gre/modules/DownloadIntegration.jsm
resource://gre/modules/DownloadLastDir.jsm
resource://gre/modules/DownloadList.jsm
resource://gre/modules/DownloadPaths.jsm
resource://gre/modules/DownloadStore.jsm
resource://gre/modules/DownloadTaskbarProgress.jsm
resource://gre/modules/DownloadUIHelper.jsm
resource://gre/modules/DownloadUtils.jsm
resource://gre/modules/Downloads.jsm
resource://gre/modules/Extension.jsm
resource://gre/modules/ExtensionContent.jsm
resource://gre/modules/ExtensionManagement.jsm
resource://gre/modules/ExtensionStorage.jsm
resource://gre/modules/ExtensionUtils.jsm
resource://gre/modules/FeedUtils.jsm
resource://gre/modules/FileUtils.jsm
resource://gre/modules/Finder.jsm
resource://gre/modules/ForgetAboutSite.jsm
resource://gre/modules/FormAutofill.jsm
resource://gre/modules/FormAutofillIntegration.jsm
resource://gre/modules/FormData.jsm
resource://gre/modules/FormHistory.jsm
resource://gre/modules/FreeSpaceWatcher.jsm
resource://gre/modules/FxAccounts.jsm
resource://gre/modules/FxAccountsClient.jsm
resource://gre/modules/FxAccountsCommon.js
resource://gre/modules/FxAccountsOAuthClient.jsm
resource://gre/modules/FxAccountsOAuthGrantClient.jsm
resource://gre/modules/FxAccountsProfile.jsm
resource://gre/modules/FxAccountsProfileClient.jsm
resource://gre/modules/FxAccountsPush.js
resource://gre/modules/FxAccountsStorage.jsm
resource://gre/modules/FxAccountsWebChannel.jsm
resource://gre/modules/GMPInstallManager.jsm
resource://gre/modules/GMPUtils.jsm
resource://gre/modules/Geometry.jsm
resource://gre/modules/History.jsm
resource://gre/modules/Http.jsm
resource://gre/modules/IOUtils.js
resource://gre/modules/ISO8601DateUtils.jsm
resource://gre/modules/ImageObjectProcessor.jsm
resource://gre/modules/ImportExport.jsm
resource://gre/modules/IndexedDBHelper.jsm
resource://gre/modules/InlineSpellChecker.jsm
resource://gre/modules/InlineSpellCheckerContent.jsm
resource://gre/modules/InsecurePasswordUtils.jsm
resource://gre/modules/Integration.jsm
resource://gre/modules/JXON.js
resource://gre/modules/Keyboard.jsm
resource://gre/modules/Langpacks.jsm
resource://gre/modules/LightweightThemeConsumer.jsm
resource://gre/modules/LightweightThemeManager.jsm
resource://gre/modules/LoadContextInfo.jsm
resource://gre/modules/Locale.jsm
resource://gre/modules/Log.jsm
resource://gre/modules/LoginHelper.jsm
resource://gre/modules/LoginImport.jsm
resource://gre/modules/LoginManagerContent.jsm
resource://gre/modules/LoginManagerParent.jsm
resource://gre/modules/LoginRecipes.jsm
resource://gre/modules/LoginStore.jsm
resource://gre/modules/MailUtils.js
resource://gre/modules/ManifestFinder.jsm
resource://gre/modules/ManifestObtainer.jsm
resource://gre/modules/ManifestProcessor.jsm
resource://gre/modules/MatchPattern.jsm
resource://gre/modules/MessageBroadcaster.jsm
resource://gre/modules/MessageChannel.jsm
resource://gre/modules/Microformats.js
resource://gre/modules/MozSocialAPI.jsm
resource://gre/modules/MulticastDNS.jsm
resource://gre/modules/NetUtil.jsm
resource://gre/modules/NewTabUtils.jsm
resource://gre/modules/NotificationDB.jsm
resource://gre/modules/OAuth2.jsm
resource://gre/modules/OAuth2Providers.jsm
resource://gre/modules/OSCrypto.jsm
resource://gre/modules/ObjectUtils.jsm
resource://gre/modules/OfflineCacheInstaller.jsm
resource://gre/modules/OperatorApps.jsm
resource://gre/modules/PageMenu.jsm
resource://gre/modules/PageMetadata.jsm
resource://gre/modules/PageThumbUtils.jsm
resource://gre/modules/PageThumbs.jsm
resource://gre/modules/PageThumbsWorker.js
resource://gre/modules/Payment.jsm
resource://gre/modules/PerfMeasurement.jsm
resource://gre/modules/PerformanceStats-content.js
resource://gre/modules/PerformanceStats.jsm
resource://gre/modules/PerformanceWatcher-content.js
resource://gre/modules/PerformanceWatcher.jsm
Traceback (most recent call last):
File "/wrkdirs/usr/ports/www/seamonkey/work/seamonkey-2.46/mozilla/toolkit/mozapps/installer/packager.py", line 415, in <module>
main()
File "/wrkdirs/usr/ports/www/seamonkey/work/seamonkey-2.46/mozilla/toolkit/mozapps/installer/packager.py", line 409, in main
args.source, gre_path, base)
File "/wrkdirs/usr/ports/www/seamonkey/work/seamonkey-2.46/mozilla/toolkit/mozapps/installer/packager.py", line 166, in precompile_cache
errors.fatal('Error while running startup cache precompilation')
File "/wrkdirs/usr/ports/www/seamonkey/work/seamonkey-2.46/mozilla/python/mozbuild/mozpack/errors.py", line 103, in fatal
self._handle(self.FATAL, msg)
File "/wrkdirs/usr/ports/www/seamonkey/work/seamonkey-2.46/mozilla/python/mozbuild/mozpack/errors.py", line 98, in _handle
raise ErrorMessage(msg)
mozpack.errors.ErrorMessage: Error: Error while running startup cache precompilation
gmake[3]: *** [/wrkdirs/usr/ports/www/seamonkey/work/seamonkey-2.46/mozilla/toolkit/mozapps/installer/packager.mk:41: stage-package] Error 1
gmake[3]: Leaving directory '/wrkdirs/usr/ports/www/seamonkey/work/seamonkey-2.46/obj-x86_64-unknown-freebsd12.0/suite/installer'
gmake[2]: *** [/wrkdirs/usr/ports/www/seamonkey/work/seamonkey-2.46/mozilla/../suite/build.mk:16: install] Error 2
gmake[2]: Leaving directory '/wrkdirs/usr/ports/www/seamonkey/work/seamonkey-2.46/obj-x86_64-unknown-freebsd12.0'
gmake[1]: *** [/wrkdirs/usr/ports/www/seamonkey/work/seamonkey-2.46/client.mk:401: install] Error 2
gmake[1]: Leaving directory '/wrkdirs/usr/ports/www/seamonkey/work/seamonkey-2.46'
*** Error code 2
Stop.
make: stopped in /usr/ports/www/seamonkey
More information about the freebsd-gecko
mailing list