Unable to instal firefox-esr-52.1.2_1,1

Peter Jeremy peter at rulingia.com
Sun Jun 11 07:14:46 UTC 2017


I'm trying to build/install firefox-esr-52.1.2_1,1 on a 10-STABLE/i386 jail
in an amd64 host but it consistently fails during the staging process (see
below).  Both the kernel and userland are in sync (r319735).  The lack of
any useful error message makes it difficult to track down what is going
wrong.  Note tha firefox-esr-52.1.2_1,1 builds and installs correctly on
the (amd64) host.

===>  Staging for firefox-esr-52.1.2_1,1
===>   firefox-esr-52.1.2_1,1 depends on file: /usr/local/lib/alsa-lib/libasound_module_pcm_oss.so - found
===>   firefox-esr-52.1.2_1,1 depends on package: alsa-lib>=1.1.1_1 - found
===>   firefox-esr-52.1.2_1,1 depends on executable: update-desktop-database - found
===>   firefox-esr-52.1.2_1,1 depends on file: /usr/local/lib/libGL.so - found
===>   firefox-esr-52.1.2_1,1 depends on file: /usr/local/libdata/pkgconfig/x11.pc - found
===>   firefox-esr-52.1.2_1,1 depends on file: /usr/local/libdata/pkgconfig/xcomposite.pc - found
===>   firefox-esr-52.1.2_1,1 depends on file: /usr/local/libdata/pkgconfig/xdamage.pc - found
===>   firefox-esr-52.1.2_1,1 depends on file: /usr/local/libdata/pkgconfig/xext.pc - found
===>   firefox-esr-52.1.2_1,1 depends on file: /usr/local/libdata/pkgconfig/xfixes.pc - found
===>   firefox-esr-52.1.2_1,1 depends on file: /usr/local/libdata/pkgconfig/xrender.pc - found
===>   firefox-esr-52.1.2_1,1 depends on file: /usr/local/libdata/pkgconfig/xt.pc - found
===>   firefox-esr-52.1.2_1,1 depends on file: /usr/local/libdata/pkgconfig/xcb.pc - found
===>   Generating temporary packing list
gmake[2]: Entering directory '/obj/usr/ports/www/firefox-esr/work/firefox-52.1.2esr'
Adding client.mk options from /obj/usr/ports/www/firefox-esr/work/firefox-52.1.2esr/.mozconfig:
MOZ_OBJDIR=/obj/usr/ports/www/firefox-esr/work/firefox-52.1.2esr/obj-i386-unknown-freebsd10.3
OBJDIR=/obj/usr/ports/www/firefox-esr/work/firefox-52.1.2esr/obj-i386-unknown-freebsd10.3
FOUND_MOZCONFIG=/obj/usr/ports/www/firefox-esr/work/firefox-52.1.2esr/.mozconfig
gmake -j8 -C /obj/usr/ports/www/firefox-esr/work/firefox-52.1.2esr/obj-i386-unknown-freebsd10.3 install
gmake[3]: Entering directory '/obj/usr/ports/www/firefox-esr/work/firefox-52.1.2esr/obj-i386-unknown-freebsd10.3'
gmake[4]: Entering directory '/obj/usr/ports/www/firefox-esr/work/firefox-52.1.2esr/obj-i386-unknown-freebsd10.3/browser/installer'
OMNIJAR_NAME=omni.ja \
NO_PKG_FILES="core bsdecho js js-config jscpucfg nsinstall viewer TestGtkEmbed elf-dynstr-gc mangle* maptsv* mfc* msdump* msmap* nm2tsv* nsinstall* res/samples res/throbber shlibsign* certutil* pk12util* BadCertServer* OCSPStaplingServer* GenerateOCSPResponse* chrome/chrome.rdf chrome/app-chrome.manifest chrome/overlayinfo components/compreg.dat components/xpti.dat content_unit_tests necko_unit_tests *.dSYM " \
/obj/usr/ports/www/firefox-esr/work/firefox-52.1.2esr/obj-i386-unknown-freebsd10.3/_virtualenv/bin/python /obj/usr/ports/www/firefox-esr/work/firefox-52.1.2esr/toolkit/mozapps/installer/packager.py -DMOZ_APP_NAME=firefox -DPREF_DIR=defaults/preferences -DMOZ_GTK=1 -DMOZ_SYSTEM_NSPR=1 -DMOZ_SYSTEM_NSS=1 -DJAREXT= -DMOZ_CHILD_PROCESS_NAME=plugin-container -DNECKO_WIFI -DDLL_PREFIX=lib -DDLL_SUFFIX=.so -DBIN_SUFFIX= -DDIR_MACOS= -DDIR_RESOURCES= -DBINPATH=bin -DRESPATH=bin -DLPROJ_ROOT=en -DMOZ_ICU_VERSION=58 -DMOZ_SYSTEM_ICU -DMOZ_ICU_DBG_SUFFIX= -DICU_DATA_FILE=icudt58l.dat -DCLANG_CXX -DACCESSIBILITY=1 -DATK_MAJOR_VERSION=2 -DATK_MINOR_VERSION=24 -DATK_REV_VERSION=0 -DBUILD_CTYPES=1 -DCROSS_COMPILE='' -DD_INO=d_ino -DENABLE_INTL_API=1 -DENABLE_MARIONETTE=1 -DENABLE_SYSTEM_EXTENSION_DIRS=1 -DEXPOSE_INTL_API=1 -DFIREFOX_VERSION=52.1.2 -DFORCE_PR_LOG=1 -DFUNCPROTO=15 -DGLIB_VERSION_MAX_ALLOWED=GLIB_VERSION_2_26 -DGLIB_VERSION_MIN_REQUIRED=GLIB_VERSION_2_26 -DGL_PROVIDER_GLX=1 -DHAVE_ARC4RANDOM=1 -DHAVE_ARC4RANDOM_BUF=1 -DHAVE_CLOCK_MONOTONIC=1 -DHAVE_CPUID_H=1 -DHAVE_DIRENT_H=1 -DHAVE_DLADDR=1 -DHAVE_DLOPEN=1 -DHAVE_FONTCONFIG_FCFREETYPE_H=1 -DHAVE_FT_BITMAP_SIZE_Y_PPEM=1 -DHAVE_FT_GLYPHSLOT_EMBOLDEN=1 -DHAVE_FT_LOAD_SFNT_TABLE=1 -DHAVE_GETOPT_H=1 -DHAVE_GMTIME_R=1 -DHAVE_I18N_LC_MESSAGES=1 -DHAVE_INTTYPES_H=1 -DHAVE_LANGINFO_CODESET=1 -DHAVE_LCHOWN=1 -DHAVE_LIBPNG=1 -DHAVE_LIBVPX=1 -DHAVE_LIBXSS=1 -DHAVE_LOCALECONV=1 -DHAVE_LOCALTIME_R=1 -DHAVE_MALLCTL=1 -DHAVE_MALLOC_USABLE_SIZE=1 -DHAVE_MEMMEM=1 -DHAVE_NETINET_IN_H=1 -DHAVE_NL_TYPES_H=1 -DHAVE_POSIX_FADVISE=1 -DHAVE_POSIX_FALLOCATE=1 -DHAVE_POSIX_MEMALIGN=1 -DHAVE_PTHREAD_H=1 -DHAVE_RES_NINIT=1 -DHAVE_SA_LEN=1 -DHAVE_SCONN_LEN=1 -DHAVE_SETPRIORITY=1 -DHAVE_SIN6_LEN=1 -DHAVE_SIN_LEN=1 -DHAVE_STDINT_H=1 -DHAVE_STRERROR=1 -DHAVE_STRNDUP=1 -DHAVE_SYSCALL=1 -DHAVE_SYS_QUEUE_H=1 -DHAVE_SYS_SOUNDCARD_H=1 -DHAVE_SYS_TYPES_H=1 -DHAVE_THREAD_TLS_KEYWORD=1 -DHAVE_UNISTD_H=1 -DHAVE_VALLOC=1 -DHAVE_VA_COPY=1 -DHAVE_VISIBILITY_ATTRIBUTE=1 -DHAVE_VISIBILITY_HIDDEN_ATTRIBUTE=1 -DHAVE__UNWIND_BACKTRACE=1 -DHAVE___CXA_DEMANGLE=1 -DINCLUDE_MOZILLA_DTRACE=1 -DJS_DEFAULT_JITREPORT_GRANULARITY=3 -DMALLOC_H='<malloc_np.h>' -DMALLOC_USABLE_SIZE_CONST_PTR=const -DMOZILLA_UAVERSION='"52.0"' -DMOZILLA_VERSION='"52.1.2"' -DMOZILLA_VERSION_U=52.1.2 -DMOZ_ACCESSIBILITY_ATK=1 -DMOZ_ADDON_SIGNING=1 -DMOZ_APP_UA_NAME='""' -DMOZ_APP_UA_VERSION='"52.1.2"' -DMOZ_B2G_OS_NAME='""' -DMOZ_B2G_VERSION='"1.0.0"' -DMOZ_BUILD_APP=browser -DMOZ_CRASHREPORTER_ENABLE_PERCENT=100 -DMOZ_DATA_REPORTING=1 -DMOZ_DISTRIBUTION_ID='"org.mozilla"' -DMOZ_DLL_SUFFIX='".so"' -DMOZ_ENABLE_GIO=1 -DMOZ_ENABLE_SIGNMAR=1 -DMOZ_ENABLE_SKIA=1 -DMOZ_ENABLE_XREMOTE=1 -DMOZ_FEEDS=1 -DMOZ_FFMPEG=1 -DMOZ_FFVPX=1 -DMOZ_FMP4=1 -DMOZ_GAMEPAD=1 -DMOZ_GLUE_IN_PROGRAM=1 -DMOZ_INSTRUMENT_EVENT_LOOP=1 -DMOZ_JEMALLOC4=1 -DMOZ_JSDOWNLOADS=1 -DMOZ_LOGGING=1 -DMOZ_MACBUNDLE_ID=org.mozilla.firefox -DMOZ_MEMORY=1 -DMOZ_OFFICIAL_BRANDING=1 -DMOZ_OGG_NO_MEM_REPORTING=1 -DMOZ_PEERCONNECTION=1 -DMOZ_PERMISSIONS=1 -DMOZ_PHOENIX=1 -DMOZ_PLACES=1 -DMOZ_RAW=1 -DMOZ_SAMPLE_TYPE_FLOAT32=1 -DMOZ_SCTP=1 -DMOZ_SECUREELEMENT=1 -DMOZ_SERVICES_HEALTHREPORT=1 -DMOZ_SRTP=1 -DMOZ_STATIC_JS=1 -DMOZ_SYSTEM_SQLITE=1 -DMOZ_UPDATER=1 -DMOZ_UPDATE_CHANNEL=esr -DMOZ_USER_DIR='".mozilla"' -DMOZ_VORBIS=1 -DMOZ_VPX_ERROR_CONCEALMENT=1 -DMOZ_VPX_NO_MEM_REPORTING=1 -DMOZ_WEBGL_CONFORMANT=1 -DMOZ_WEBM_ENCODER=1 -DMOZ_WEBRTC=1 -DMOZ_WEBRTC_ASSERT_ALWAYS=1 -DMOZ_WEBRTC_SIGNALING=1 -DMOZ_WEBSPEECH=1 -DMOZ_WEBSPEECH_TEST_BACKEND=1 -DMOZ_WIDGET_GTK=2 -DMOZ_X11=1 -DMOZ_XUL=1 -DNO_NSPR_10_SUPPORT=1 -DNS_PRINTING=1 -DNS_PRINT_PREVIEW=1 -DRELEASE_OR_BETA=1 -DSPIDERMONKEY_PROMISE=1 -DSTATIC_JS_API=1 -DSTDC_HEADERS=1 -DTARGET_XPCOM_ABI='"x86-gcc3"' -DUSE_SKIA=1 -DUSE_SKIA_GPU=1 -DVA_COPY=va_copy -DXP_UNIX=1 -D_REENTRANT=1 -D_THREAD_SAFE=1 -DAB_CD=en-US \
        --format omni \
        --removals /obj/usr/ports/www/firefox-esr/work/firefox-52.1.2esr/browser/installer/removed-files.in \
        \
        \
        \
        \
        --optimizejars \
        \
        \
        /obj/usr/ports/www/firefox-esr/work/firefox-52.1.2esr/browser/installer/package-manifest.in ../../dist ../../dist/firefox \
        
Executing /obj/usr/ports/www/firefox-esr/work/firefox-52.1.2esr/obj-i386-unknown-freebsd10.3/dist/bin/xpcshell -g /obj/usr/ports/www/firefox-esr/work/firefox-52.1.2esr/obj-i386-unknown-freebsd10.3/dist/bin/ -a /obj/usr/ports/www/firefox-esr/work/firefox-52.1.2esr/obj-i386-unknown-freebsd10.3/dist/bin/ -f /obj/usr/ports/www/firefox-esr/work/firefox-52.1.2esr/toolkit/mozapps/installer/precompile_cache.js -e precompile_startupcache("resource://gre/");
Traceback (most recent call last):
  File "/obj/usr/ports/www/firefox-esr/work/firefox-52.1.2esr/toolkit/mozapps/installer/packager.py", line 415, in <module>
    main()
  File "/obj/usr/ports/www/firefox-esr/work/firefox-52.1.2esr/toolkit/mozapps/installer/packager.py", line 409, in main
    args.source, gre_path, base)
  File "/obj/usr/ports/www/firefox-esr/work/firefox-52.1.2esr/toolkit/mozapps/installer/packager.py", line 166, in precompile_cache
    errors.fatal('Error while running startup cache precompilation')
  File "/obj/usr/ports/www/firefox-esr/work/firefox-52.1.2esr/python/mozbuild/mozpack/errors.py", line 103, in fatal
    self._handle(self.FATAL, msg)
  File "/obj/usr/ports/www/firefox-esr/work/firefox-52.1.2esr/python/mozbuild/mozpack/errors.py", line 98, in _handle
    raise ErrorMessage(msg)
mozpack.errors.ErrorMessage: Error: Error while running startup cache precompilation
gmake[4]: *** [/obj/usr/ports/www/firefox-esr/work/firefox-52.1.2esr/toolkit/mozapps/installer/packager.mk:41: stage-package] Error 1
gmake[4]: Leaving directory '/obj/usr/ports/www/firefox-esr/work/firefox-52.1.2esr/obj-i386-unknown-freebsd10.3/browser/installer'
gmake[3]: *** [/obj/usr/ports/www/firefox-esr/work/firefox-52.1.2esr/browser/build.mk:21: install] Error 2
gmake[3]: Leaving directory '/obj/usr/ports/www/firefox-esr/work/firefox-52.1.2esr/obj-i386-unknown-freebsd10.3'
gmake[2]: *** [/obj/usr/ports/www/firefox-esr/work/firefox-52.1.2esr/client.mk:422: install] Error 2
gmake[2]: Leaving directory '/obj/usr/ports/www/firefox-esr/work/firefox-52.1.2esr'
*** Error code 2

Stop.
make[1]: stopped in /usr/ports/www/firefox-esr
*** Error code 1

-- 
Peter Jeremy
-------------- next part --------------
A non-text attachment was scrubbed...
Name: signature.asc
Type: application/pgp-signature
Size: 949 bytes
Desc: not available
URL: <http://lists.freebsd.org/pipermail/freebsd-gecko/attachments/20170611/6123cf6e/attachment.sig>


More information about the freebsd-gecko mailing list