Chromium build fails on Current (r233121)
Lars Engels
lars.engels at 0x20.net
Sun Mar 18 20:11:18 UTC 2012
Build of Chromium 17.0.963.79 fails to build on r233121, amd64:
CXX(target) out/Release/obj.target/webkit_gpu/webkit/gpu/webgraphicscontext3d_in_process_impl.o
LINK(host) out/Release/protoc
AR(host) out/Release/obj.host/v8/tools/gyp/libv8_nosnapshot.a
RULE sync_proto_genproto_0 out/Release/pyproto/chrome/browser/sync/protocol/sync_pb2.py
gmake: *** [out/Release/pyproto/chrome/browser/sync/protocol/sync_pb2.py] Floating point exception: 8 (core dumped)
gmake: *** Waiting for unfinished jobs....
*** [do-build] Error code 1
Stop in /usr/ports/www/chromium.
*** [build] Error code 1
The backtrace is:
gdb /usr/ports/www/chromium/work/chromium-courgette-redacted-17.0.963.79/out/Release/protoc protoc.core (y|n|e)?yes
[GDB will not be able to debug user-mode threads: Undefined symbol "td_thr_getxmmregs"]
GNU gdb 6.1.1 [FreeBSD]
Copyright 2004 Free Software Foundation, Inc.
GDB is free software, covered by the GNU General Public License, and you are
welcome to change it and/or distribute copies of it under certain conditions.
Type "show copying" to see the conditions.
There is absolutely no warranty for GDB. Type "show warranty" for details.
This GDB was configured as "amd64-marcel-freebsd"...(no debugging symbols found)...
Core was generated by `protoc'.
Program terminated with signal 8, Arithmetic exception.
Reading symbols from /usr/lib/libstdc++.so.6...(no debugging symbols found)...done.
Loaded symbols for /usr/lib/libstdc++.so.6
Reading symbols from /lib/libthr.so.3...(no debugging symbols found)...done.
Loaded symbols for /lib/libthr.so.3
Reading symbols from /lib/libc.so.7...(no debugging symbols found)...done.
Loaded symbols for /lib/libc.so.7
Reading symbols from /lib/libm.so.5...(no debugging symbols found)...done.
Loaded symbols for /lib/libm.so.5
Reading symbols from /lib/libgcc_s.so.1...(no debugging symbols found)...done.
Loaded symbols for /lib/libgcc_s.so.1
Reading symbols from /libexec/ld-elf.so.1...(no debugging symbols found)...done.
Loaded symbols for /libexec/ld-elf.so.1
#0 0x00000000004b0e54 in google::protobuf::compiler::Parser::ParseType ()
(gdb) bt
#0 0x00000000004b0e54 in google::protobuf::compiler::Parser::ParseType ()
#1 0x00000000004b5f7f in google::protobuf::compiler::Parser::ParseMessageField ()
#2 0x00000000004b72dc in google::protobuf::compiler::Parser::ParseMessageStatement ()
#3 0x00000000004b73be in google::protobuf::compiler::Parser::ParseMessageBlock ()
#4 0x00000000004b7558 in google::protobuf::compiler::Parser::ParseMessageDefinition ()
#5 0x00000000004b767f in google::protobuf::compiler::Parser::ParseTopLevelStatement ()
#6 0x00000000004b7bd7 in google::protobuf::compiler::Parser::Parse ()
#7 0x00000000004ac560 in google::protobuf::compiler::SourceTreeDescriptorDatabase::FindFileByName ()
#8 0x000000000047cf15 in google::protobuf::DescriptorPool::TryFindFileInFallbackDatabase ()
#9 0x000000000047d025 in google::protobuf::DescriptorPool::FindFileByName ()
#10 0x0000000000411921 in google::protobuf::compiler::CommandLineInterface::Run ()
#11 0x000000000045c220 in main ()
Lars
-------------- next part --------------
A non-text attachment was scrubbed...
Name: not available
Type: application/pgp-signature
Size: 196 bytes
Desc: not available
Url : http://lists.freebsd.org/pipermail/freebsd-chromium/attachments/20120318/b48d6ff4/attachment.pgp
More information about the freebsd-chromium
mailing list