Build failed in Jenkins: FreeBSD_HEAD_arm64 #62

jenkins-admin at freebsd.org jenkins-admin at freebsd.org
Mon Apr 27 13:07:24 UTC 2015


See <https://jenkins.freebsd.org/job/FreeBSD_HEAD_arm64/62/changes>

Changes:

[des] Upgrade Unbound to 1.5.3.

[des] Add a script that runs configure for both ldns and drill.

Run configure for drill (I forgot to do it when I imported 1.6.17, but the
omission was harmless).  Note that running configure --with-drill at the
top level doesn't quite work for us since it is geared toward the slightly
weird upstream Makefiles, which we don't use.

[des] Restore packaging subdir to enable running unmodified configure script.

[trasz] Make setproctitle(3) work in Capsicum capability mode.  This makes
ctld(8) child processes to indicate initiator address and name in
their titles, similar to what iscsid(8) child processes do.

PR:		181352
Differential Revision:	https://reviews.freebsd.org/D2363
Reviewed by:	rwatson@, mjg@
MFC after:	1 month
Sponsored by:	The FreeBSD Foundation

[kib] Partially revert r255986: do not call VOP_FSYNC() when helping
bufdaemon in getnewbuf(), do use buf_flush().  The difference is that
bufdaemon uses TRYLOCK to get buffer locks, which allows calls to
getnewbuf() while another buffer is locked.

Reported and tested by:	pho
Sponsored by:	The FreeBSD Foundation
MFC after:	1 week

[kib] Fix locking for oshmctl() and shmsys().

Reported and tested by:	pho
Sponsored by:	The FreeBSD Foundation
MFC after:	1 week

[andrew] Add GCC to the list of broken options on arm64.

[melifaro] Fix 'may be used uninitialized' warning not caught by clang.

[melifaro] Use free_nat_instance() for nat instance deletion.

Sponsored by:	Yandex LLC

[zbb] Introduce ddb(4) support for ARM64

Obtained from: Semihalf
Reviewed by:   emaste
Sponsored by:  The FreeBSD Foundation

[ngie] Integrate tools/regression/mmap into the FreeBSD test suite as
tests/sys/kern/mmap_test

MFC after: 1 week

[ngie] Convert this testcase over to a TAP format testcase

MFC after: 1 week

------------------------------------------
[...truncated 5079 lines...]
===> lib/msun/tests (clean)
--- games.cleandir__D ---
--- cleanobj ---
--- cddl.cleandir__D ---
rm -f libzpool.so
--- kerberos5.cleandir__D ---
--- clean ---
--- cddl.cleandir__D ---
rm -f libzpool.a libzpool.so.2
--- kerberos5.cleandir__D ---
rm -f asn1_OCSPBasicOCSPResponse.x  asn1_OCSPCertID.x  asn1_OCSPCertStatus.x  asn1_OCSPInnerRequest.x  asn1_OCSPKeyHash.x  asn1_OCSPRequest.x  asn1_OCSPResponderID.x  asn1_OCSPResponse.x  asn1_OCSPResponseBytes.x  asn1_OCSPResponseData.x  asn1_OCSPResponseStatus.x  asn1_OCSPSignature.x  asn1_OCSPSingleResponse.x  asn1_OCSPTBSRequest.x  asn1_OCSPVersion.x  asn1_id_pkix_ocsp.x  asn1_id_pkix_ocsp_basic.x  asn1_id_pkix_ocsp_nonce.x  ocsp_asn1.hx  ocsp_asn1-priv.hx asn1_CertificationRequestInfo.x  asn1_CertificationRequest.x  pkcs10_asn1.hx  pkcs10_asn1-priv.hx asn1_CRMFRDNSequence.x  asn1_CertReqMessages.x  asn1_CertReqMsg.x  asn1_CertRequest.x  asn1_CertTemplate.x  asn1_Controls.x  asn1_PBMParameter.x  asn1_PKMACValue.x  asn1_POPOPrivKey.x  asn1_POPOSigningKey.x  asn1_POPOSigningKeyInput.x  asn1_ProofOfPossession.x  asn1_SubsequentMessage.x  crmf_asn1.hx  crmf_asn1-priv.hx asn1_OCSPBasicOCSPResponse.c asn1_OCSPCertID.c asn1_OCSPCertStatus.c asn1_OCSPInnerRequest.c asn1_OCSPKeyHash.c asn1_OCSPRequest.c asn1_OCSPResponderID.c asn1_OCSPResponse.c asn1_OCSPResponseBytes.c asn1_OCSPResponseData.c asn1_OCSPResponseStatus.c asn1_OCSPSignature.c asn1_OCSPSingleResponse.c asn1_OCSPTBSRequest.c asn1_OCSPVersion.c asn1_id_pkix_ocsp.c asn1_id_pkix_ocsp_basic.c asn1_id_pkix_ocsp_nonce.c ocsp_asn1.h ocsp_asn1-priv.h asn1_CertificationRequestInfo.c asn1_CertificationRequest.c pkcs10_asn1.h pkcs10_asn1-priv.h asn1_CRMFRDNSequence.c asn1_CertReqMessages.c asn1_CertReqMsg.c asn1_CertRequest.c asn1_CertTemplate.c asn1_Controls.c asn1_PBMParameter.c asn1_PKMACValue.c asn1_POPOPrivKey.c asn1_POPOSigningKey.c asn1_POPOSigningKeyInput.c asn1_ProofOfPossession.c asn1_SubsequentMessage.c crmf_asn1.h crmf_asn1-priv.h ocsp_asn1_files  pkcs10_asn1_files crmf_asn1_files ocsp_asn1-template.[ch]*  pkcs10_asn1-template.[ch]* crmf_asn1-template.[ch]* hx509_err.h hx509_err.c hx509.3.gz hx509_ca.3.gz hx509_cert.3.gz hx509_cms.3.gz hx509_crypto.3.gz hx509_env.3.gz hx509_error.3.gz hx509_keyset.3.gz hx509_lock.3.gz hx509_misc.3.gz hx509_name.3.gz hx509_peer.3.gz hx509_print.3.gz hx509_query.3.gz hx509_revoke.3.gz hx509_verify.3.gz hx509.3.cat.gz hx509_ca.3.cat.gz hx509_cert.3.cat.gz hx509_cms.3.cat.gz hx509_crypto.3.cat.gz hx509_env.3.cat.gz hx509_error.3.cat.gz hx509_keyset.3.cat.gz hx509_lock.3.cat.gz hx509_misc.3.cat.gz hx509_name.3.cat.gz hx509_peer.3.cat.gz hx509_print.3.cat.gz hx509_query.3.cat.gz hx509_revoke.3.cat.gz hx509_verify.3.cat.gz sel-lex.c sel-gram.c sel-gram.h
--- lib.cleandir__D ---
make[5]: "<https://jenkins.freebsd.org/job/FreeBSD_HEAD_arm64/ws/lib/msun/tests/Makefile"> line 11: Malformed conditional (${MACHINE} == "sparc" || ${MACHINE} == "i386"  || ${MACHINE} == "amd64" || ${MACHINE_CPU} == "arm"	 || ${MACHINE} == "sparc64")
--- cddl.cleandir__D ---
--- cleandepend ---
--- games.cleandir__D ---
===> games/pom (cleandir)
--- cddl.cleandir__D ---
rm -f .depend GPATH GRTAGS GSYMS GTAGS
--- kerberos5.cleandir__D ---
rm -f a.out ca.o cert.o cms.o collector.o crypto.o doxygen.o error.o env.o file.o sel.o sel-gram.o sel-lex.o keyset.o ks_dir.o ks_file.o ks_mem.o ks_null.o ks_p11.o ks_p12.o ks_keychain.o lock.o name.o peer.o print.o softp11.o req.o revoke.o hx509_err.o asn1_OCSPBasicOCSPResponse.o asn1_OCSPCertID.o asn1_OCSPCertStatus.o asn1_OCSPInnerRequest.o asn1_OCSPKeyHash.o asn1_OCSPRequest.o asn1_OCSPResponderID.o asn1_OCSPResponse.o asn1_OCSPResponseBytes.o asn1_OCSPResponseData.o asn1_OCSPResponseStatus.o asn1_OCSPSignature.o asn1_OCSPSingleResponse.o asn1_OCSPTBSRequest.o asn1_OCSPVersion.o asn1_id_pkix_ocsp.o asn1_id_pkix_ocsp_basic.o asn1_id_pkix_ocsp_nonce.o asn1_CertificationRequestInfo.o asn1_CertificationRequest.o ca.o.tmp cert.o.tmp cms.o.tmp collector.o.tmp crypto.o.tmp doxygen.o.tmp error.o.tmp env.o.tmp file.o.tmp sel.o.tmp sel-gram.o.tmp sel-lex.o.tmp keyset.o.tmp ks_dir.o.tmp ks_file.o.tmp ks_mem.o.tmp ks_null.o.tmp ks_p11.o.tmp ks_p12.o.tmp ks_keychain.o.tmp lock.o.tmp name.o.tmp peer.o.tmp print.o.tmp softp11.o.tmp req.o.tmp revoke.o.tmp hx509_err.o.tmp asn1_OCSPBasicOCSPResponse.o.tmp asn1_OCSPCertID.o.tmp asn1_OCSPCertStatus.o.tmp asn1_OCSPInnerRequest.o.tmp asn1_OCSPKeyHash.o.tmp asn1_OCSPRequest.o.tmp asn1_OCSPResponderID.o.tmp asn1_OCSPResponse.o.tmp asn1_OCSPResponseBytes.o.tmp asn1_OCSPResponseData.o.tmp asn1_OCSPResponseStatus.o.tmp asn1_OCSPSignature.o.tmp asn1_OCSPSingleResponse.o.tmp asn1_OCSPTBSRequest.o.tmp asn1_OCSPVersion.o.tmp asn1_id_pkix_ocsp.o.tmp asn1_id_pkix_ocsp_basic.o.tmp asn1_id_pkix_ocsp_nonce.o.tmp asn1_CertificationRequestInfo.o.tmp asn1_CertificationRequest.o.tmp 
--- cddl.cleandir__D ---
--- cleanobj ---
--- kerberos5.cleandir__D ---
rm -f ca.po cert.po cms.po collector.po crypto.po doxygen.po error.po env.po file.po sel.po sel-gram.po sel-lex.po keyset.po ks_dir.po ks_file.po ks_mem.po ks_null.po ks_p11.po ks_p12.po ks_keychain.po lock.po name.po peer.po print.po softp11.po req.po revoke.po hx509_err.po asn1_OCSPBasicOCSPResponse.po asn1_OCSPCertID.po asn1_OCSPCertStatus.po asn1_OCSPInnerRequest.po asn1_OCSPKeyHash.po asn1_OCSPRequest.po asn1_OCSPResponderID.po asn1_OCSPResponse.po asn1_OCSPResponseBytes.po asn1_OCSPResponseData.po asn1_OCSPResponseStatus.po asn1_OCSPSignature.po asn1_OCSPSingleResponse.po asn1_OCSPTBSRequest.po asn1_OCSPVersion.po asn1_id_pkix_ocsp.po asn1_id_pkix_ocsp_basic.po asn1_id_pkix_ocsp_nonce.po asn1_CertificationRequestInfo.po asn1_CertificationRequest.po  ca.po.tmp cert.po.tmp cms.po.tmp collector.po.tmp crypto.po.tmp doxygen.po.tmp error.po.tmp env.po.tmp file.po.tmp sel.po.tmp sel-gram.po.tmp sel-lex.po.tmp keyset.po.tmp ks_dir.po.tmp ks_file.po.tmp ks_mem.po.tmp ks_null.po.tmp ks_p11.po.tmp ks_p12.po.tmp k--- include.cleandir__D ---
--- cleanobj ---
--- kerberos5.cleandir__D ---
s_keychain.po.tmp lock.po.tmp name.po.tmp peer.po.tmp print.po.tmp softp11.po.tmp req.po.tmp revoke.po.tmp hx509_err.po.tmp asn1_OCSPBasicOCSPResponse.po.tmp asn1_OCSPCertID.po.tmp asn1_OCSPCertStatus.po.tmp asn1_OCSPInnerRequest.po.tmp asn1_OCSPKeyHash.po.tmp asn1_OCSPRequest.po.tmp asn1_OCSPResponderID.po.tmp asn1_OCSPResponse.po.tmp asn1_OCSPResponseBytes.po.tmp asn1_OCSPResponseData.po.tmp asn1_OCSPResponseStatus.po.tmp asn1_OCSPSignature.po.tmp asn1_OCSPSingleResponse.po.tmp asn1_OCSPTBSRequest.po.tmp asn1_OCSPVersion.po.tmp asn1_id_pkix_ocsp.po.tmp asn1_id_pkix_ocsp_basic.po.tmp asn1_id_pkix_ocsp_nonce.po.tmp asn1_CertificationRequestInfo.po.tmp asn1_CertificationRequest.po.tmp
--- gnu.cleandir__D ---
--- _sub.clean ---
===> gnu/lib/libssp/libssp_nonshared (clean)
--- bin.cleandir__D ---
--- clean ---
--- cddl.cleandir__D ---
===> cddl/lib/tests (cleandir)
--- kerberos5.cleandir__D ---
rm -f ca.So cert.So cms.So collector.So crypto.So doxygen.So error.So env.So file.So sel.So sel-gram.So sel-lex.So keyset.So ks_dir.So ks_file.So ks_mem.So ks_null.So ks_p11.So ks_p12.So ks_keychain.So lock.So name.So peer.So print.So softp11.So req.So revoke.So hx509_err.So asn1_OCSPBasicOCSPResponse.So asn1_OCSPCertID.So asn1_OCSPCertStatus.So asn1_OCSPInnerRequest.So asn1_OCSPKeyHash.So asn1_OCSPRequest.So asn1_OCSPResponderID.So asn1_OCSPResponse.So asn1_OCSPResponseBytes.So asn1_OCSPResponseData.So asn1_OCSPResponseStatus.So asn1_OCSPSignature.So asn1_OCSPSingleResponse.So asn1_OCSPTBSRequest.So asn1_OCSPVersion.So asn1_id_pkix_ocsp.So asn1_id_pkix_ocsp_basic.So asn1_id_pkix_ocsp_nonce.So asn1_CertificationRequestInfo.So asn1_CertificationRequest.So ca.so cert.so cms.so collector.so crypto.so doxygen.so error.so env.so file.so sel.so sel-gram.so sel-lex.so keyset.so ks_dir.so ks_file.so ks_mem.so ks_null.so ks_p11.so ks_p12.so ks_keychain.so lock.so name.so peer.so print.so softp11.so req.so revoke.so hx--- include.cleandir__D ---
===> include/rpcsvc (cleandir)
--- kerberos5.cleandir__D ---
509_err.so asn1_OCSPBasicOCSPResponse.so asn1_OCSPCertID.so asn1_OCSPCertStatus.so asn1_OCSPInnerRequest.so asn1_OCSPKeyHash.so asn1_OCSPRequest.so asn1_OCSPResponderID.so asn1_OCSPResponse.so asn1_OCSPResponseBytes.so asn1_OCSPResponseData.so asn1_OCSPResponseStatus.so asn1_OCSPSignature.so asn1_OCSPSingleResponse.so asn1_OCSPTBSRequest.so asn1_OCSPVersion.so asn1_id_pkix_ocsp.so asn1_id_pkix_ocsp_basic.so asn1_id_pkix_ocsp_nonce.so asn1_CertificationRequestInfo.so asn1_CertificationRequest.so ca.So.tmp cert.So.tmp cms.So.tmp collector.So.tmp crypto.So.tmp doxygen.So.tmp error.So.tmp env.So.tmp file.So.tmp sel.So.tmp sel-gram.So.tmp sel-lex.So.tmp keyset.So.tmp ks_dir.So.tmp ks_file.So.tmp ks_mem.So.tmp ks_null.So.tmp ks_p11.So.tmp ks_p12.So.tmp ks_keychain.So.tmp lock.So.tmp name.So.tmp peer.So.tmp print.So.tmp softp11.So.tmp req.So.tmp revoke.So.tmp hx509_err.So.tmp asn1_OCSPBasicOCSPResponse.So.tmp asn1_OCSPCertID.So.tmp asn1_OCSPCertStatus.So.tmp asn1_OCSPInnerRequest.So.tmp asn1_OCSPKeyHash.So.tmp asn1_--- bin.cleandir__D ---
rm -f chflags chflags.o chflags.1.gz chflags.1.cat.gz
--- kerberos5.cleandir__D ---
OCSPRequest.So.tmp asn1_OCSPResponderID.So.tmp asn1_OCSPResponse.So.tmp asn1_OCSPResponseBytes.So.tmp asn1_OCSPResponseData.So.tmp asn1_OCSPResponseStatus.So.tmp asn1_OCSPSignature.So.tmp asn1_OCSPSingleResponse.So.tmp asn1_OCSPTBSRequest.So.tmp asn1_OCSPVersion.So.tmp asn1_id_pkix_ocsp.So.tmp asn1_id_pkix_ocsp_basic.So.tmp asn1_id_pkix_ocsp_nonce.So.tmp asn1_CertificationRequestInfo.So.tmp asn1_CertificationRequest.So.tmp
rm -f libhx509.so
--- bin.cleandir__D ---
--- cleandepend ---
--- kerberos5.cleandir__D ---
rm -f libhx509.a libhx509_p.a libhx509.so.11
--- bin.cleandir__D ---
rm -f .depend GPATH GRTAGS GSYMS GTAGS
--- kerberos5.cleandir__D ---
--- cleandepend ---
rm -f .depend GPATH GRTAGS GSYMS GTAGS
--- bin.cleandir__D ---
--- cleanobj ---
--- kerberos5.cleandir__D ---
--- cleanobj ---
--- bin.cleandir__D ---
--- cleandir_subdir_chio ---
--- kerberos5.cleandir__D ---
===> kerberos5/lib/libkadm5clnt (cleandir)
--- bin.cleandir__D ---
===> bin/chio (cleandir)
--- lib.cleandir__D ---
make[5]: Fatal errors encountered -- cannot continue
make[5]: stopped in <https://jenkins.freebsd.org/job/FreeBSD_HEAD_arm64/ws/lib/msun/tests>
*** [_sub.clean] Error code 1

make[4]: stopped in <https://jenkins.freebsd.org/job/FreeBSD_HEAD_arm64/ws/lib/msun>
--- libexec.cleandir__D ---
--- _sub.clean ---
--- lib.cleandir__D ---
1 error

make[4]: stopped in <https://jenkins.freebsd.org/job/FreeBSD_HEAD_arm64/ws/lib/msun>
--- games.cleandir__D ---
A failure has been detected in another branch of the parallel make

make[4]: stopped in <https://jenkins.freebsd.org/job/FreeBSD_HEAD_arm64/ws/games/pom>
--- libexec.cleandir__D ---
===> libexec/atf/atf-sh/tests (clean)
--- games.cleandir__D ---
*** [_sub.cleandir] Error code 2

make[3]: stopped in <https://jenkins.freebsd.org/job/FreeBSD_HEAD_arm64/ws/games>
1 error

make[3]: stopped in <https://jenkins.freebsd.org/job/FreeBSD_HEAD_arm64/ws/games>
--- lib.cleandir__D ---
*** [cleandir_subdir_msun] Error code 2

make[3]: stopped in <https://jenkins.freebsd.org/job/FreeBSD_HEAD_arm64/ws/lib>
1 error

make[3]: stopped in <https://jenkins.freebsd.org/job/FreeBSD_HEAD_arm64/ws/lib>
--- games.cleandir__D ---
*** [games.cleandir__D] Error code 2

make[2]: stopped in <https://jenkins.freebsd.org/job/FreeBSD_HEAD_arm64/ws/>
--- gnu.cleandir__D ---
A failure has been detected in another branch of the parallel make
--- include.cleandir__D ---
A failure has been detected in another branch of the parallel make

make[4]: stopped in <https://jenkins.freebsd.org/job/FreeBSD_HEAD_arm64/ws/include/rpcsvc>
--- cddl.cleandir__D ---
A failure has been detected in another branch of the parallel make

make[5]: stopped in <https://jenkins.freebsd.org/job/FreeBSD_HEAD_arm64/ws/cddl/lib/tests>
--- gnu.cleandir__D ---

make[6]: stopped in <https://jenkins.freebsd.org/job/FreeBSD_HEAD_arm64/ws/gnu/lib/libssp/libssp_nonshared>
--- include.cleandir__D ---
*** [_sub.cleandir] Error code 2

make[3]: stopped in <https://jenkins.freebsd.org/job/FreeBSD_HEAD_arm64/ws/include>
--- lib.cleandir__D ---
*** [lib.cleandir__D] Error code 2

make[2]: stopped in <https://jenkins.freebsd.org/job/FreeBSD_HEAD_arm64/ws/>
--- include.cleandir__D ---
1 error

make[3]: stopped in <https://jenkins.freebsd.org/job/FreeBSD_HEAD_arm64/ws/include>
--- cddl.cleandir__D ---
*** [_sub.cleandir] Error code 2

make[4]: stopped in <https://jenkins.freebsd.org/job/FreeBSD_HEAD_arm64/ws/cddl/lib>
1 error
--- gnu.cleandir__D ---
*** [_sub.clean] Error code 2

make[5]: stopped in <https://jenkins.freebsd.org/job/FreeBSD_HEAD_arm64/ws/gnu/lib/libssp>
--- cddl.cleandir__D ---

make[4]: stopped in <https://jenkins.freebsd.org/job/FreeBSD_HEAD_arm64/ws/cddl/lib>
--- gnu.cleandir__D ---
1 error

make[5]: stopped in <https://jenkins.freebsd.org/job/FreeBSD_HEAD_arm64/ws/gnu/lib/libssp>
--- include.cleandir__D ---
*** [include.cleandir__D] Error code 2

make[2]: stopped in <https://jenkins.freebsd.org/job/FreeBSD_HEAD_arm64/ws/>
--- cddl.cleandir__D ---
*** [_sub.cleandir] Error code 2

make[3]: stopped in <https://jenkins.freebsd.org/job/FreeBSD_HEAD_arm64/ws/cddl>
1 error

make[3]: stopped in <https://jenkins.freebsd.org/job/FreeBSD_HEAD_arm64/ws/cddl>
--- gnu.cleandir__D ---
*** [_sub.cleandir] Error code 2

make[4]: stopped in <https://jenkins.freebsd.org/job/FreeBSD_HEAD_arm64/ws/gnu/lib>
1 error

make[4]: stopped in <https://jenkins.freebsd.org/job/FreeBSD_HEAD_arm64/ws/gnu/lib>
--- cddl.cleandir__D ---
*** [cddl.cleandir__D] Error code 2

make[2]: stopped in <https://jenkins.freebsd.org/job/FreeBSD_HEAD_arm64/ws/>
--- gnu.cleandir__D ---
*** [_sub.cleandir] Error code 2

make[3]: stopped in <https://jenkins.freebsd.org/job/FreeBSD_HEAD_arm64/ws/gnu>
1 error

make[3]: stopped in <https://jenkins.freebsd.org/job/FreeBSD_HEAD_arm64/ws/gnu>
*** [gnu.cleandir__D] Error code 2

make[2]: stopped in <https://jenkins.freebsd.org/job/FreeBSD_HEAD_arm64/ws/>
--- kerberos5.cleandir__D ---
A failure has been detected in another branch of the parallel make

make[5]: stopped in <https://jenkins.freebsd.org/job/FreeBSD_HEAD_arm64/ws/kerberos5/lib/libkadm5clnt>
*** [_sub.cleandir] Error code 2

make[4]: stopped in <https://jenkins.freebsd.org/job/FreeBSD_HEAD_arm64/ws/kerberos5/lib>
1 error

make[4]: stopped in <https://jenkins.freebsd.org/job/FreeBSD_HEAD_arm64/ws/kerberos5/lib>
*** [_sub.cleandir] Error code 2

make[3]: stopped in <https://jenkins.freebsd.org/job/FreeBSD_HEAD_arm64/ws/kerberos5>
1 error
--- bin.cleandir__D ---
A failure has been detected in another branch of the parallel make

make[4]: stopped in <https://jenkins.freebsd.org/job/FreeBSD_HEAD_arm64/ws/bin/chio>
--- kerberos5.cleandir__D ---

make[3]: stopped in <https://jenkins.freebsd.org/job/FreeBSD_HEAD_arm64/ws/kerberos5>
--- bin.cleandir__D ---
*** [cleandir_subdir_chio] Error code 2

make[3]: stopped in <https://jenkins.freebsd.org/job/FreeBSD_HEAD_arm64/ws/bin>
1 error

make[3]: stopped in <https://jenkins.freebsd.org/job/FreeBSD_HEAD_arm64/ws/bin>
--- kerberos5.cleandir__D ---
*** [kerberos5.cleandir__D] Error code 2

make[2]: stopped in <https://jenkins.freebsd.org/job/FreeBSD_HEAD_arm64/ws/>
--- bin.cleandir__D ---
*** [bin.cleandir__D] Error code 2

make[2]: stopped in <https://jenkins.freebsd.org/job/FreeBSD_HEAD_arm64/ws/>
--- libexec.cleandir__D ---
A failure has been detected in another branch of the parallel make

make[6]: stopped in <https://jenkins.freebsd.org/job/FreeBSD_HEAD_arm64/ws/libexec/atf/atf-sh/tests>
*** [_sub.clean] Error code 2

make[5]: stopped in <https://jenkins.freebsd.org/job/FreeBSD_HEAD_arm64/ws/libexec/atf/atf-sh>
1 error

make[5]: stopped in <https://jenkins.freebsd.org/job/FreeBSD_HEAD_arm64/ws/libexec/atf/atf-sh>
*** [_sub.cleandir] Error code 2

make[4]: stopped in <https://jenkins.freebsd.org/job/FreeBSD_HEAD_arm64/ws/libexec/atf>
1 error

make[4]: stopped in <https://jenkins.freebsd.org/job/FreeBSD_HEAD_arm64/ws/libexec/atf>
*** [_sub.cleandir] Error code 2

make[3]: stopped in <https://jenkins.freebsd.org/job/FreeBSD_HEAD_arm64/ws/libexec>
1 error

make[3]: stopped in <https://jenkins.freebsd.org/job/FreeBSD_HEAD_arm64/ws/libexec>
*** [libexec.cleandir__D] Error code 2

make[2]: stopped in <https://jenkins.freebsd.org/job/FreeBSD_HEAD_arm64/ws/>
8 errors

make[2]: stopped in <https://jenkins.freebsd.org/job/FreeBSD_HEAD_arm64/ws/>
*** [_cleanobj] Error code 2

make[1]: stopped in <https://jenkins.freebsd.org/job/FreeBSD_HEAD_arm64/ws/>
1 error

make[1]: stopped in <https://jenkins.freebsd.org/job/FreeBSD_HEAD_arm64/ws/>
*** [buildworld] Error code 2

make: stopped in <https://jenkins.freebsd.org/job/FreeBSD_HEAD_arm64/ws/>
1 error

make: stopped in <https://jenkins.freebsd.org/job/FreeBSD_HEAD_arm64/ws/>
Build step 'Execute shell' marked build as failure


More information about the freebsd-arm mailing list