[package - 131powerpc64le-quarterly][java/openjdk18] Failed for openjdk18-18.0.2+9.1_1 in build

From: <pkg-fallout_at_FreeBSD.org>
Date: Sun, 07 May 2023 19:03:07 UTC
You are receiving this mail as a port that you maintain
is failing to build on the FreeBSD package build server.
Please investigate the failure and submit a PR to fix
build.

Maintainer:     java@FreeBSD.org
Log URL:        https://pkg-status.freebsd.org/foul2/data/131powerpc64le-quarterly/e0fbf5a0186d/logs/openjdk18-18.0.2+9.1_1.log
Build URL:      https://pkg-status.freebsd.org/foul2/build.html?mastername=131powerpc64le-quarterly&build=e0fbf5a0186d
Log:

=>> Building java/openjdk18
build started at Sun May  7 18:48:22 UTC 2023
port directory: /usr/ports/java/openjdk18
package name: openjdk18-18.0.2+9.1_1
building for: FreeBSD 131powerpc64le-quarterly-job-21 13.1-RELEASE FreeBSD 13.1-RELEASE powerpc
maintained by: java@FreeBSD.org
Makefile ident: 
Poudriere version: 3.2.8-23-ga7f8d188
Host OSVERSION: 1400087
Jail OSVERSION: 1301000
Job Id: 21

---Begin Environment---
SHELL=/bin/csh
OSVERSION=1301000
UNAME_v=FreeBSD 13.1-RELEASE
UNAME_r=13.1-RELEASE
BLOCKSIZE=K
MAIL=/var/mail/root
MM_CHARSET=UTF-8
LANG=C.UTF-8
STATUS=1
HOME=/root
PATH=/sbin:/bin:/usr/sbin:/usr/bin:/usr/local/sbin:/usr/local/bin:/root/bin
LOCALBASE=/usr/local
USER=root
LIBEXECPREFIX=/usr/local/libexec/poudriere
POUDRIERE_VERSION=3.2.8-23-ga7f8d188
MASTERMNT=/usr/local/poudriere/data/.m/131powerpc64le-quarterly/ref
POUDRIERE_BUILD_TYPE=bulk
PACKAGE_BUILDING=yes
SAVED_TERM=
PWD=/usr/local/poudriere/data/.m/131powerpc64le-quarterly/ref/.p/pool
P_PORTS_FEATURES=FLAVORS SELECTED_OPTIONS
MASTERNAME=131powerpc64le-quarterly
SCRIPTPREFIX=/usr/local/share/poudriere
OLDPWD=/usr/local/poudriere/data/.m/131powerpc64le-quarterly/ref/.p
SCRIPTPATH=/usr/local/share/poudriere/bulk.sh
POUDRIEREPATH=/usr/local/bin/poudriere
---End Environment---

---Begin Poudriere Port Flags/Env---
PORT_FLAGS=
PKGENV=
FLAVOR=
DEPENDS_ARGS=
MAKE_ARGS=
---End Poudriere Port Flags/Env---

---Begin OPTIONS List---
---End OPTIONS List---

--MAINTAINER--
java@FreeBSD.org
--End MAINTAINER--

--CONFIGURE_ARGS--
--with-boot-jdk=/usr/local/bootstrap-openjdk17  --disable-ccache  --disable-javac-server  --disable-hotspot-gtest  --with-alsa=/usr/local  --with-cups=/usr/local  --with-fontconfig=/usr/local  --with-freetype=system  --with-freetype-include=/usr/local/include/freetype2  --with-freetype-lib=/usr/local/lib  --with-libjpeg=system  --with-giflib=system  --with-giflib-include=/usr/local/include  --with-giflib-lib=/usr/local/lib  --with-harfbuzz=system  --with-libpng=system  --with-zlib=system  --with-lcms=system  --x-includes=/usr/local/include  --x-libraries=/usr/local/lib  --with-version-string=18.0.2+9-1  --with-native-debug-symbols=none  --with-debug-level=release  --with-vendor-name="OpenJDK BSD Porting Team"  --with-vendor-url="https://github.com/battleblow/jdk18u/"  --with-vendor-bug-url="https://bugs.freebsd.org/bugzilla/enter_bug.cgi?product=Ports%20%26%20Packages&component=Individual%20Port(s)&short_desc=java/openjdk18%3A%20"  --with-vendor-vm-bug-url="https://bugs.freebsd.org/b
 ugzilla/enter_bug.cgi?product=Ports%20%26%20Packages&component=Individual%20Port(s)&short_desc=java/openjdk18%3A%20" --with-toolchain-type=clang --with-extra-cflags="-Wno-unused-but-set-parameter" --with-extra-cxxflags="-Wno-unused-but-set-parameter" --disable-warnings-as-errors --x-libraries=/usr/local/lib --x-includes=/usr/local/include --prefix=/usr/local ${_LATE_CONFIGURE_ARGS}
--End CONFIGURE_ARGS--

--CONFIGURE_ENV--
CC=cc  CXX=c++  CPP=cpp  ac_cv_path_SED=/usr/local/bin/gsed MAKE=gmake PKG_CONFIG=pkgconf XDG_DATA_HOME=/wrkdirs/usr/ports/java/openjdk18/work  XDG_CONFIG_HOME=/wrkdirs/usr/ports/java/openjdk18/work  XDG_CACHE_HOME=/wrkdirs/usr/ports/java/openjdk18/work/.cache  HOME=/wrkdirs/usr/ports/java/openjdk18/work TMPDIR="/tmp" PATH=/wrkdirs/usr/ports/java/openjdk18/work/.bin:/sbin:/bin:/usr/sbin:/usr/bin:/usr/local/sbin:/usr/local/bin:/root/bin PKG_CONFIG_LIBDIR=/wrkdirs/usr/ports/java/openjdk18/work/.pkgconfig:/usr/local/libdata/pkgconfig:/usr/local/share/pkgconfig:/usr/libdata/pkgconfig SHELL=/bin/sh CONFIG_SHELL=/bin/sh CONFIG_SITE=/usr/ports/Templates/config.site lt_cv_sys_max_cmd_len=524288
--End CONFIGURE_ENV--

--MAKE_ENV--
LANG="C"  LC_ALL="C"  CLASSPATH=""  JAVA_HOME=""  LD_LIBRARY_PATH=""  CC=cc  CXX=c++  CPP=cpp  MAKEFLAGS="" --with-toolchain-type=clang USE_CLANG=true XDG_DATA_HOME=/wrkdirs/usr/ports/java/openjdk18/work  XDG_CONFIG_HOME=/wrkdirs/usr/ports/java/openjdk18/work  XDG_CACHE_HOME=/wrkdirs/usr/ports/java/openjdk18/work/.cache  HOME=/wrkdirs/usr/ports/java/openjdk18/work TMPDIR="/tmp" PATH=/wrkdirs/usr/ports/java/openjdk18/work/.bin:/sbin:/bin:/usr/sbin:/usr/bin:/usr/local/sbin:/usr/local/bin:/root/bin PKG_CONFIG_LIBDIR=/wrkdirs/usr/ports/java/openjdk18/work/.pkgconfig:/usr/local/libdata/pkgconfig:/usr/local/share/pkgconfig:/usr/libdata/pkgconfig MK_DEBUG_FILES=no MK_KERNEL_SYMBOLS=no SHELL=/bin/sh NO_LINT=YES PREFIX=/usr/local  LOCALBASE=/usr/local  CC="cc" CFLAGS="-O2 -pipe  -DLIBICONV_PLUG -fstack-protector-strong -fno-strict-aliasing "  CPP="cpp" CPPFLAGS="-DLIBICONV_PLUG"  LDFLAGS=" -fstack-protector-strong " LIBS=""  CXX="c++" CXXFLAGS="-O2 -pipe -DLIBICONV_PLUG -fstack-protector-stro
 ng -fno-strict-aliasing  -DLIBICONV_PLUG "  MANPREFIX="/usr/local" BSD_INSTALL_PROGRAM="install  -s -m 555"  BSD_INSTALL_LIB="install  -s -m 0644"  BSD_INSTALL_SCRIPT="install  -m 555"  BSD_INSTALL_DATA="install  -m 0644"  BSD_INSTALL_MAN="install  -m 444"
--End MAKE_ENV--

--PLIST_SUB--
OSREL=13.1 PREFIX=%D LOCALBASE=/usr/local  RESETPREFIX=/usr/local LIB32DIR=lib DOCSDIR="share/doc/openjdk"  EXAMPLESDIR="share/examples/openjdk"  DATADIR="share/openjdk"  WWWDIR="www/openjdk"  ETCDIR="etc/openjdk"
--End PLIST_SUB--

--SUB_LIST--
PREFIX=/usr/local LOCALBASE=/usr/local  DATADIR=/usr/local/share/openjdk DOCSDIR=/usr/local/share/doc/openjdk EXAMPLESDIR=/usr/local/share/examples/openjdk  WWWDIR=/usr/local/www/openjdk ETCDIR=/usr/local/etc/openjdk
--End SUB_LIST--

---Begin make.conf---
USE_PACKAGE_DEPENDS=yes
BATCH=yes
WRKDIRPREFIX=/wrkdirs
PORTSDIR=/usr/ports
PACKAGES=/packages
DISTDIR=/distfiles
PACKAGE_BUILDING=yes
PACKAGE_BUILDING_FLAVORS=yes
#### /usr/local/etc/poudriere.d/make.conf ####
# XXX: We really need this but cannot use it while 'make checksum' does not
# try the next mirror on checksum failure.  It currently retries the same
# failed mirror and then fails rather then trying another.  It *does*
# try the next if the size is mismatched though.
#MASTER_SITE_FREEBSD=yes
# Build ALLOW_MAKE_JOBS_PACKAGES with 2 jobs
MAKE_JOBS_NUMBER=2
#### /usr/ports/Mk/Scripts/ports_env.sh ####
_CCVERSION_921dbbb2=FreeBSD clang version 13.0.0 (git@github.com:llvm/llvm-project.git llvmorg-13.0.0-0-gd7b669b3a303) Target: powerpc64le-unknown-freebsd13.1 Thread model: posix InstalledDir: /usr/bin
_ALTCCVERSION_921dbbb2=none
_CXXINTERNAL_acaad9ca=FreeBSD clang version 13.0.0 (git@github.com:llvm/llvm-project.git llvmorg-13.0.0-0-gd7b669b3a303) Target: powerpc64le-unknown-freebsd13.1 Thread model: posix InstalledDir: /usr/bin "/usr/bin/ld" "--eh-frame-hdr" "-dynamic-linker" "/libexec/ld-elf.so.1" "--enable-new-dtags" "-o" "a.out" "/usr/lib/crt1.o" "/usr/lib/crti.o" "/usr/lib/crtbegin.o" "-L/usr/lib" "/dev/null" "-lc++" "-lm" "-lgcc" "--as-needed" "-lgcc_s" "--no-as-needed" "-lc" "-lgcc" "--as-needed" "-lgcc_s" "--no-as-needed" "/usr/lib/crtend.o" "/usr/lib/crtn.o"
CC_OUTPUT_921dbbb2_58173849=yes
CC_OUTPUT_921dbbb2_9bdba57c=yes
CC_OUTPUT_921dbbb2_6a4fe7f5=yes
CC_OUTPUT_921dbbb2_6bcac02b=yes
CC_OUTPUT_921dbbb2_67d20829=yes
CC_OUTPUT_921dbbb2_bfa62e83=yes
CC_OUTPUT_921dbbb2_f0b4d593=yes
CC_OUTPUT_921dbbb2_308abb44=yes
CC_OUTPUT_921dbbb2_f00456e5=yes
CC_OUTPUT_921dbbb2_65ad290d=yes
CC_OUTPUT_921dbbb2_f2776b26=yes
CC_OUTPUT_921dbbb2_53255a77=yes
CC_OUTPUT_921dbbb2_911cfe02=yes
CC_OUTPUT_921dbbb2_b2657cc3=yes
CC_OUTPUT_921dbbb2_380987f7=yes
CC_OUTPUT_921dbbb2_160933ec=yes
CC_OUTPUT_921dbbb2_fb62803b=yes
CC_OUTPUT_921dbbb2_af59ad06=yes
CC_OUTPUT_921dbbb2_a15f3fcf=yes
_OBJC_CCVERSION_921dbbb2=FreeBSD clang version 13.0.0 (git@github.com:llvm/llvm-project.git llvmorg-13.0.0-0-gd7b669b3a303) Target: powerpc64le-unknown-freebsd13.1 Thread model: posix InstalledDir: /usr/bin
_OBJC_ALTCCVERSION_921dbbb2=none
ARCH=powerpc64le
OPSYS=FreeBSD
_OSRELEASE=13.1-RELEASE
OSREL=13.1
OSVERSION=1301000
PYTHONBASE=/usr/local
CONFIGURE_MAX_CMD_LEN=524288
HAVE_PORTS_ENV=1
#### Misc Poudriere ####
GID=0
UID=0
---End make.conf---
--Resource limits--
cpu time               (seconds, -t)  unlimited
file size           (512-blocks, -f)  unlimited
data seg size           (kbytes, -d)  33554432
stack size              (kbytes, -s)  524288
core file size      (512-blocks, -c)  unlimited
max memory size         (kbytes, -m)  unlimited
locked memory           (kbytes, -l)  unlimited
max user processes              (-u)  89999
open files                      (-n)  1024
virtual mem size        (kbytes, -v)  unlimited
swap limit              (kbytes, -w)  unlimited
socket buffer size       (bytes, -b)  unlimited
pseudo-terminals                (-p)  unlimited
kqueues                         (-k)  unlimited
umtx shared locks               (-o)  unlimited
--End resource limits--
=======================<phase: check-sanity   >============================
===>  License GPLv2 accepted by the user
===========================================================================
=======================<phase: pkg-depends    >============================
===>   openjdk18-18.0.2+9.1_1 depends on file: /usr/local/sbin/pkg - not found
===>   Installing existing package /packages/All/pkg-1.19.1_1.pkg
[131powerpc64le-quarterly-job-21] Installing pkg-1.19.1_1...
[131powerpc64le-quarterly-job-21] Extracting pkg-1.19.1_1: .......... done
===>   openjdk18-18.0.2+9.1_1 depends on file: /usr/local/sbin/pkg - found
===>   Returning to build of openjdk18-18.0.2+9.1_1
===========================================================================
=======================<phase: fetch-depends  >============================
===========================================================================
=======================<phase: fetch          >============================
===>  License GPLv2 accepted by the user
===> Fetching all distfiles required by openjdk18-18.0.2+9.1_1 for building
===========================================================================
=======================<phase: checksum       >============================
===>  License GPLv2 accepted by the user
===> Fetching all distfiles required by openjdk18-18.0.2+9.1_1 for building
=> SHA256 Checksum OK for battleblow-jdk18u-jdk-18.0.2+9-1_GH0.tar.gz.
===========================================================================
=======================<phase: extract-depends>============================
===========================================================================
=======================<phase: extract        >============================
===>  License GPLv2 accepted by the user
===> Fetching all distfiles required by openjdk18-18.0.2+9.1_1 for building
===>  Extracting for openjdk18-18.0.2+9.1_1
=> SHA256 Checksum OK for battleblow-jdk18u-jdk-18.0.2+9-1_GH0.tar.gz.
===========================================================================
=======================<phase: patch-depends  >============================
===========================================================================
=======================<phase: patch          >============================
===>  Patching for openjdk18-18.0.2+9.1_1
===>  Applying FreeBSD patches for openjdk18-18.0.2+9.1_1 from /usr/ports/java/openjdk18/files
===========================================================================
=======================<phase: build-depends  >============================
===>   openjdk18-18.0.2+9.1_1 depends on executable: zip - not found
===>   Installing existing package /packages/All/zip-3.0_1.pkg
[131powerpc64le-quarterly-job-21] Installing zip-3.0_1...
[131powerpc64le-quarterly-job-21] Extracting zip-3.0_1: .......... done
===>   openjdk18-18.0.2+9.1_1 depends on executable: zip - found
===>   Returning to build of openjdk18-18.0.2+9.1_1
===>   openjdk18-18.0.2+9.1_1 depends on package: autoconf>0 - not found
===>   Installing existing package /packages/All/autoconf-2.71.pkg
[131powerpc64le-quarterly-job-21] Installing autoconf-2.71...
[131powerpc64le-quarterly-job-21] `-- Installing autoconf-switch-20220527...
[131powerpc64le-quarterly-job-21] `-- Extracting autoconf-switch-20220527: .......... done
[131powerpc64le-quarterly-job-21] `-- Installing indexinfo-0.3.1...
[131powerpc64le-quarterly-job-21] `-- Extracting indexinfo-0.3.1: .... done
[131powerpc64le-quarterly-job-21] `-- Installing m4-1.4.19,1...
[131powerpc64le-quarterly-job-21] |   `-- Installing gettext-runtime-0.21.1...
<snip>
gmake[4]: Entering directory '/wrkdirs/usr/ports/java/openjdk18/work/jdk18u-jdk-18.0.2-9-1/make'
Compiling 199 files for java.naming
gmake[4]: Leaving directory '/wrkdirs/usr/ports/java/openjdk18/work/jdk18u-jdk-18.0.2-9-1/make'
gmake[4]: Leaving directory '/wrkdirs/usr/ports/java/openjdk18/work/jdk18u-jdk-18.0.2-9-1/make'
gmake[4]: Leaving directory '/wrkdirs/usr/ports/java/openjdk18/work/jdk18u-jdk-18.0.2-9-1/make'
gmake[4]: Entering directory '/wrkdirs/usr/ports/java/openjdk18/work/jdk18u-jdk-18.0.2-9-1/make'
gmake[4]: Entering directory '/wrkdirs/usr/ports/java/openjdk18/work/jdk18u-jdk-18.0.2-9-1/make'
Compiling 24 files for jdk.management
Creating support/modules_libs/java.management/libmanagement.so from 9 file(s)
gmake[4]: Leaving directory '/wrkdirs/usr/ports/java/openjdk18/work/jdk18u-jdk-18.0.2-9-1/make'
gmake[4]: Entering directory '/wrkdirs/usr/ports/java/openjdk18/work/jdk18u-jdk-18.0.2-9-1/make'
gmake[4]: Entering directory '/wrkdirs/usr/ports/java/openjdk18/work/jdk18u-jdk-18.0.2-9-1/make'
Compiling 11 files for jdk.jstatd
Creating support/modules_libs/java.rmi/librmi.so from 1 file(s)
gmake[4]: Leaving directory '/wrkdirs/usr/ports/java/openjdk18/work/jdk18u-jdk-18.0.2-9-1/make'
gmake[4]: Leaving directory '/wrkdirs/usr/ports/java/openjdk18/work/jdk18u-jdk-18.0.2-9-1/make'
gmake[4]: Leaving directory '/wrkdirs/usr/ports/java/openjdk18/work/jdk18u-jdk-18.0.2-9-1/make'
gmake[4]: Entering directory '/wrkdirs/usr/ports/java/openjdk18/work/jdk18u-jdk-18.0.2-9-1/make'
Creating support/modules_libs/jdk.crypto.cryptoki/libj2pkcs11.so from 14 file(s)
gmake[4]: Leaving directory '/wrkdirs/usr/ports/java/openjdk18/work/jdk18u-jdk-18.0.2-9-1/make'
gmake[4]: Leaving directory '/wrkdirs/usr/ports/java/openjdk18/work/jdk18u-jdk-18.0.2-9-1/make'
gmake[4]: Leaving directory '/wrkdirs/usr/ports/java/openjdk18/work/jdk18u-jdk-18.0.2-9-1/make'
gmake[4]: Leaving directory '/wrkdirs/usr/ports/java/openjdk18/work/jdk18u-jdk-18.0.2-9-1/make'
gmake[4]: Leaving directory '/wrkdirs/usr/ports/java/openjdk18/work/jdk18u-jdk-18.0.2-9-1/make'
gmake[4]: Entering directory '/wrkdirs/usr/ports/java/openjdk18/work/jdk18u-jdk-18.0.2-9-1/make'
gmake[4]: Entering directory '/wrkdirs/usr/ports/java/openjdk18/work/jdk18u-jdk-18.0.2-9-1/make'
Compiling 15 files for jdk.management.jfr
Creating support/modules_libs/jdk.management/libmanagement_ext.so from 8 file(s)
gmake[4]: Leaving directory '/wrkdirs/usr/ports/java/openjdk18/work/jdk18u-jdk-18.0.2-9-1/make'
gmake[4]: Leaving directory '/wrkdirs/usr/ports/java/openjdk18/work/jdk18u-jdk-18.0.2-9-1/make'
gmake[4]: Leaving directory '/wrkdirs/usr/ports/java/openjdk18/work/jdk18u-jdk-18.0.2-9-1/make'
gmake[4]: Entering directory '/wrkdirs/usr/ports/java/openjdk18/work/jdk18u-jdk-18.0.2-9-1/make'
gmake[4]: Entering directory '/wrkdirs/usr/ports/java/openjdk18/work/jdk18u-jdk-18.0.2-9-1/make'
gmake[4]: Entering directory '/wrkdirs/usr/ports/java/openjdk18/work/jdk18u-jdk-18.0.2-9-1/make'
gmake[4]: Entering directory '/wrkdirs/usr/ports/java/openjdk18/work/jdk18u-jdk-18.0.2-9-1/make'
Compiling 16 files for java.management.rmi
Compiling 8 files for jdk.naming.rmi
Compiling 212 files for java.security.jgss
Compiling 16 files for jdk.naming.dns
#
# A fatal error has been detected by the Java Runtime Environment:
#
#  SIGBUS (0xa) at pc=0x000000081322dbe4, pid=48134, tid=266725
#
# JRE version: OpenJDK Runtime Environment (17.0.1+12) (build 17.0.1+12-1)
# Java VM: OpenJDK 64-Bit Server VM (17.0.1+12-1, mixed mode, tiered, compressed oops, compressed class ptrs, g1 gc, bsd-ppc64le)
# Problematic frame:
# J 7413 c2 com.sun.tools.javac.comp.Resolve.rawInstantiate(Lcom/sun/tools/javac/comp/Env;Lcom/sun/tools/javac/code/Type;Lcom/sun/tools/javac/code/Symbol;Lcom/sun/tools/javac/comp/Attr$ResultInfo;Lcom/sun/tools/javac/util/List;Lcom/sun/tools/javac/util/List;ZZLcom/sun/tools/javac/util/Warner;)Lcom/sun/tools/javac/code/Type; jdk.compiler.interim (508 bytes) @ 0x000000081322dbe4 [0x000000081322bb80+0x0000000000002064]
#
# Core dump will be written. Default location: /wrkdirs/usr/ports/java/openjdk18/work/jdk18u-jdk-18.0.2-9-1/make/java.core
#
# An error report file with more information is saved as:
# /wrkdirs/usr/ports/java/openjdk18/work/jdk18u-jdk-18.0.2-9-1/make/hs_err_pid48134.log
Compiled method (c2)   43332 7413       4       com.sun.tools.javac.comp.Resolve::rawInstantiate (508 bytes)
 total in heap  [0x000000081322ad90,0x0000000813230810] = 23168
 relocation     [0x000000081322aee0,0x000000081322b528] = 1608
 constants      [0x000000081322b580,0x000000081322bb80] = 1536
 main code      [0x000000081322bb80,0x000000081322db00] = 8064
 stub code      [0x000000081322db00,0x000000081322e790] = 3216
 oops           [0x000000081322e790,0x000000081322e810] = 128
 metadata       [0x000000081322e810,0x000000081322ea38] = 552
 scopes data    [0x000000081322ea38,0x000000081322fa20] = 4072
 scopes pcs     [0x000000081322fa20,0x0000000813230250] = 2096
 dependencies   [0x0000000813230250,0x00000008132302d0] = 128
 handler table  [0x00000008132302d0,0x0000000813230618] = 840
 nul chk table  [0x0000000813230618,0x0000000813230810] = 504
Compiled method (c2)   43332 7413       4       com.sun.tools.javac.comp.Resolve::rawInstantiate (508 bytes)
 total in heap  [0x000000081322ad90,0x0000000813230810] = 23168
 relocation     [0x000000081322aee0,0x000000081322b528] = 1608
 constants      [0x000000081322b580,0x000000081322bb80] = 1536
 main code      [0x000000081322bb80,0x000000081322db00] = 8064
 stub code      [0x000000081322db00,0x000000081322e790] = 3216
 oops           [0x000000081322e790,0x000000081322e810] = 128
 metadata       [0x000000081322e810,0x000000081322ea38] = 552
 scopes data    [0x000000081322ea38,0x000000081322fa20] = 4072
 scopes pcs     [0x000000081322fa20,0x0000000813230250] = 2096
 dependencies   [0x0000000813230250,0x00000008132302d0] = 128
 handler table  [0x00000008132302d0,0x0000000813230618] = 840
 nul chk table  [0x0000000813230618,0x0000000813230810] = 504
Compiled method (c2)   43332 2663       4       com.sun.tools.javac.code.Type$MethodType::getTag (4 bytes)
 total in heap  [0x0000000812ec7b90,0x0000000812ec7e78] = 744
 relocation     [0x0000000812ec7ce0,0x0000000812ec7cf0] = 16
 constants      [0x0000000812ec7d00,0x0000000812ec7d80] = 128
 main code      [0x0000000812ec7d80,0x0000000812ec7e00] = 128
 stub code      [0x0000000812ec7e00,0x0000000812ec7e38] = 56
 oops           [0x0000000812ec7e38,0x0000000812ec7e48] = 16
 scopes data    [0x0000000812ec7e48,0x0000000812ec7e50] = 8
 scopes pcs     [0x0000000812ec7e50,0x0000000812ec7e70] = 32
 dependencies   [0x0000000812ec7e70,0x0000000812ec7e78] = 8
Compiled method (c2)   43379 7413       4       com.sun.tools.javac.comp.Resolve::rawInstantiate (508 bytes)
 total in heap  [0x000000081322ad90,0x0000000813230810] = 23168
 relocation     [0x000000081322aee0,0x000000081322b528] = 1608
 constants      [0x000000081322b580,0x000000081322bb80] = 1536
 main code      [0x000000081322bb80,0x000000081322db00] = 8064
 stub code      [0x000000081322db00,0x000000081322e790] = 3216
 oops           [0x000000081322e790,0x000000081322e810] = 128
 metadata       [0x000000081322e810,0x000000081322ea38] = 552
 scopes data    [0x000000081322ea38,0x000000081322fa20] = 4072
 scopes pcs     [0x000000081322fa20,0x0000000813230250] = 2096
 dependencies   [0x0000000813230250,0x00000008132302d0] = 128
 handler table  [0x00000008132302d0,0x0000000813230618] = 840
 nul chk table  [0x0000000813230618,0x0000000813230810] = 504
Compiled method (c2)   43391 7413       4       com.sun.tools.javac.comp.Resolve::rawInstantiate (508 bytes)
 total in heap  [0x000000081322ad90,0x0000000813230810] = 23168
 relocation     [0x000000081322aee0,0x000000081322b528] = 1608
 constants      [0x000000081322b580,0x000000081322bb80] = 1536
 main code      [0x000000081322bb80,0x000000081322db00] = 8064
 stub code      [0x000000081322db00,0x000000081322e790] = 3216
 oops           [0x000000081322e790,0x000000081322e810] = 128
 metadata       [0x000000081322e810,0x000000081322ea38] = 552
 scopes data    [0x000000081322ea38,0x000000081322fa20] = 4072
 scopes pcs     [0x000000081322fa20,0x0000000813230250] = 2096
 dependencies   [0x0000000813230250,0x00000008132302d0] = 128
 handler table  [0x00000008132302d0,0x0000000813230618] = 840
 nul chk table  [0x0000000813230618,0x0000000813230810] = 504
Compiled method (c2)   43413 7413       4       com.sun.tools.javac.comp.Resolve::rawInstantiate (508 bytes)
 total in heap  [0x000000081322ad90,0x0000000813230810] = 23168
 relocation     [0x000000081322aee0,0x000000081322b528] = 1608
 constants      [0x000000081322b580,0x000000081322bb80] = 1536
 main code      [0x000000081322bb80,0x000000081322db00] = 8064
 stub code      [0x000000081322db00,0x000000081322e790] = 3216
 oops           [0x000000081322e790,0x000000081322e810] = 128
 metadata       [0x000000081322e810,0x000000081322ea38] = 552
 scopes data    [0x000000081322ea38,0x000000081322fa20] = 4072
 scopes pcs     [0x000000081322fa20,0x0000000813230250] = 2096
 dependencies   [0x0000000813230250,0x00000008132302d0] = 128
 handler table  [0x00000008132302d0,0x0000000813230618] = 840
 nul chk table  [0x0000000813230618,0x0000000813230810] = 504
Compiled method (c2)   43430 5527       4       com.sun.tools.javac.comp.Check::checkType (168 bytes)
 total in heap  [0x0000000813076190,0x0000000813083670] = 54496
 relocation     [0x00000008130762e0,0x0000000813076fa8] = 3272
 constants      [0x0000000813077000,0x0000000813077e00] = 3584
 main code      [0x0000000813077e00,0x000000081307e800] = 27136
 stub code      [0x000000081307e800,0x000000081307fe98] = 5784
 oops           [0x000000081307fe98,0x000000081307ffd0] = 312
 metadata       [0x000000081307ffd0,0x0000000813080418] = 1096
 scopes data    [0x0000000813080418,0x0000000813081ce8] = 6352
 scopes pcs     [0x0000000813081ce8,0x0000000813082af8] = 3600
 dependencies   [0x0000000813082af8,0x0000000813082b98] = 160
 handler table  [0x0000000813082b98,0x0000000813083438] = 2208
 nul chk table  [0x0000000813083438,0x0000000813083670] = 568
#
# If you would like to submit a bug report, please visit:
#   https://bugs.freebsd.org/bugzilla/enter_bug.cgi?product=Ports%20%26%20Packages&component=Individual%20Port(s)&short_desc=java/openjdk17%3A%20
#
gmake[4]: Leaving directory '/wrkdirs/usr/ports/java/openjdk18/work/jdk18u-jdk-18.0.2-9-1/make'
gmake[4]: Leaving directory '/wrkdirs/usr/ports/java/openjdk18/work/jdk18u-jdk-18.0.2-9-1/make'
/usr/local/bin/bash: line 1: 48134 Abort trap              (core dumped) /usr/local/bootstrap-openjdk17/bin/java -Xms64M -Xmx1600M -Duser.language=en -Duser.country=US -XX:+UnlockDiagnosticVMOptions -XX:-VerifySharedSpaces -XX:SharedArchiveFile=/wrkdirs/usr/ports/java/openjdk18/work/jdk18u-jdk-18.0.2-9-1/build/bsd-ppc64le-server-release/configure-support/classes.jsa -Xshare:auto --limit-modules java.base,jdk.zipfs,java.compiler.interim,jdk.compiler.interim,jdk.javadoc.interim --add-modules java.compiler.interim,jdk.compiler.interim,jdk.javadoc.interim --module-path /wrkdirs/usr/ports/java/openjdk18/work/jdk18u-jdk-18.0.2-9-1/build/bsd-ppc64le-server-release/buildtools/interim_langtools_modules --patch-module java.base=/wrkdirs/usr/ports/java/openjdk18/work/jdk18u-jdk-18.0.2-9-1/build/bsd-ppc64le-server-release/buildtools/gensrc/java.base.interim --add-exports java.base/sun.reflect.annotation=jdk.compiler.interim --add-exports java.base/jdk.internal.jmod=jdk.compiler.interim --add-exp
 orts java.base/jdk.internal.misc=jdk.compiler.interim --add-exports java.base/sun.invoke.util=jdk.compiler.interim --add-exports java.base/jdk.internal.javac=java.compiler.interim --add-exports java.base/jdk.internal.javac=jdk.compiler.interim -m jdk.compiler.interim/com.sun.tools.javac.Main -g -Xlint:all -source 18 -target 18 -implicit:none -Xprefer:source -XDignore.symbol.file=true -encoding ascii -Werror -Xdoclint:all/protected '-Xdoclint/package:-com.sun.tools.*,-jdk.internal.*,sun.tools.serialver.resources.*' -XDstringConcat=inline --module-source-path "/wrkdirs/usr/ports/java/openjdk18/work/jdk18u-jdk-18.0.2-9-1/build/bsd-ppc64le-server-release/support/gensrc/*:/wrkdirs/usr/ports/java/openjdk18/work/jdk18u-jdk-18.0.2-9-1/src/*/bsd/classes:/wrkdirs/usr/ports/java/openjdk18/work/jdk18u-jdk-18.0.2-9-1/src/*/unix/classes:/wrkdirs/usr/ports/java/openjdk18/work/jdk18u-jdk-18.0.2-9-1/src/*/share/classes" --module-path "" --system none -classpath /wrkdirs/usr/ports/java/openjdk18/work
 /jdk18u-jdk-18.0.2-9-1/build/bsd-ppc64le-ser!
 ver-release/buildtools/depend -Xplugin:"depend /wrkdirs/usr/ports/java/openjdk18/work/jdk18u-jdk-18.0.2-9-1/build/bsd-ppc64le-server-release/jdk/modules/jdk.compiler/_the.jdk.compiler_pubapi" -d /wrkdirs/usr/ports/java/openjdk18/work/jdk18u-jdk-18.0.2-9-1/build/bsd-ppc64le-server-release/jdk/modules -h /wrkdirs/usr/ports/java/openjdk18/work/jdk18u-jdk-18.0.2-9-1/build/bsd-ppc64le-server-release/support/headers.jdk.compiler.tmp @/wrkdirs/usr/ports/java/openjdk18/work/jdk18u-jdk-18.0.2-9-1/build/bsd-ppc64le-server-release/jdk/modules/jdk.compiler/_the.jdk.compiler_batch.filelist > >(/usr/bin/tee -a /wrkdirs/usr/ports/java/openjdk18/work/jdk18u-jdk-18.0.2-9-1/build/bsd-ppc64le-server-release/jdk/modules/jdk.compiler/_the.jdk.compiler_batch.log) 2> >(/usr/bin/tee -a /wrkdirs/usr/ports/java/openjdk18/work/jdk18u-jdk-18.0.2-9-1/build/bsd-ppc64le-server-release/jdk/modules/jdk.compiler/_the.jdk.compiler_batch.log 1>&2)
gmake[4]: *** [CompileJavaModules.gmk:95: /wrkdirs/usr/ports/java/openjdk18/work/jdk18u-jdk-18.0.2-9-1/build/bsd-ppc64le-server-release/jdk/modules/jdk.compiler/_the.jdk.compiler_batch] Error 134
gmake[4]: Leaving directory '/wrkdirs/usr/ports/java/openjdk18/work/jdk18u-jdk-18.0.2-9-1/make'
gmake[3]: *** [make/Main.gmk:193: jdk.compiler-java] Error 2
gmake[3]: *** Waiting for unfinished jobs....
gmake[4]: Leaving directory '/wrkdirs/usr/ports/java/openjdk18/work/jdk18u-jdk-18.0.2-9-1/make'
gmake[4]: Leaving directory '/wrkdirs/usr/ports/java/openjdk18/work/jdk18u-jdk-18.0.2-9-1/make'
gmake[4]: Leaving directory '/wrkdirs/usr/ports/java/openjdk18/work/jdk18u-jdk-18.0.2-9-1/make'
gmake[4]: Leaving directory '/wrkdirs/usr/ports/java/openjdk18/work/jdk18u-jdk-18.0.2-9-1/make'
gmake[4]: Leaving directory '/wrkdirs/usr/ports/java/openjdk18/work/jdk18u-jdk-18.0.2-9-1/make'
gmake[3]: Leaving directory '/wrkdirs/usr/ports/java/openjdk18/work/jdk18u-jdk-18.0.2-9-1'

ERROR: Build failed for target 'images' in configuration 'bsd-ppc64le-server-release' (exit code 2) 
gmake[3]: Entering directory '/wrkdirs/usr/ports/java/openjdk18/work/jdk18u-jdk-18.0.2-9-1'

=== Output from failing command(s) repeated here ===
* For target jdk_modules_jdk.compiler__the.jdk.compiler_batch:
#
# A fatal error has been detected by the Java Runtime Environment:
#
#  SIGBUS (0xa) at pc=0x000000081322dbe4, pid=48134, tid=266725
#
# JRE version: OpenJDK Runtime Environment (17.0.1+12) (build 17.0.1+12-1)
# Java VM: OpenJDK 64-Bit Server VM (17.0.1+12-1, mixed mode, tiered, compressed oops, compressed class ptrs, g1 gc, bsd-ppc64le)
# Problematic frame:
# J 7413 c2 com.sun.tools.javac.comp.Resolve.rawInstantiate(Lcom/sun/tools/javac/comp/Env;Lcom/sun/tools/javac/code/Type;Lcom/sun/tools/javac/code/Symbol;Lcom/sun/tools/javac/comp/Attr$ResultInfo;Lcom/sun/tools/javac/util/List;Lcom/sun/tools/javac/util/List;ZZLcom/sun/tools/javac/util/Warner;)Lcom/sun/tools/javac/code/Type; jdk.compiler.interim (508 bytes) @ 0x000000081322dbe4 [0x000000081322bb80+0x0000000000002064]
#
# Core dump will be written. Default location: /wrkdirs/usr/ports/java/openjdk18/work/jdk18u-jdk-18.0.2-9-1/make/java.core
#
# An error report file with more information is saved as:
# /wrkdirs/usr/ports/java/openjdk18/work/jdk18u-jdk-18.0.2-9-1/make/hs_err_pid48134.log
Compiled method (c2)   43332 7413       4       com.sun.tools.javac.comp.Resolve::rawInstantiate (508 bytes)
   ... (rest of output omitted)

* All command lines available in /wrkdirs/usr/ports/java/openjdk18/work/jdk18u-jdk-18.0.2-9-1/build/bsd-ppc64le-server-release/make-support/failure-logs.
=== End of repeated output ===

No indication of failed target found.
Hint: Try searching the build log for '] Error'.
Hint: See doc/building.html#troubleshooting for assistance.

gmake[3]: Leaving directory '/wrkdirs/usr/ports/java/openjdk18/work/jdk18u-jdk-18.0.2-9-1'
gmake[2]: *** [/wrkdirs/usr/ports/java/openjdk18/work/jdk18u-jdk-18.0.2-9-1/make/Init.gmk:315: main] Error 2
gmake[2]: Leaving directory '/wrkdirs/usr/ports/java/openjdk18/work/jdk18u-jdk-18.0.2-9-1'
gmake[1]: *** [/wrkdirs/usr/ports/java/openjdk18/work/jdk18u-jdk-18.0.2-9-1/make/Init.gmk:186: images] Error 2
gmake[1]: Leaving directory '/wrkdirs/usr/ports/java/openjdk18/work/jdk18u-jdk-18.0.2-9-1'
===> Compilation failed unexpectedly.
Try to set MAKE_JOBS_UNSAFE=yes and rebuild before reporting the failure to
the maintainer.
*** Error code 1

Stop.
make: stopped in /usr/ports/java/openjdk18