FreeBSD-main-amd64-test - Build #25924 - Still Unstable
Date: Thu, 16 Jan 2025 04:37:24 UTC
FreeBSD-main-amd64-test - Build #25924 (101e825e551afc69a7cebb78fa6b676d38d93d2d) - Still Unstable Build information: https://ci.FreeBSD.org/job/FreeBSD-main-amd64-test/25924/ Full change log: https://ci.FreeBSD.org/job/FreeBSD-main-amd64-test/25924/changes Full build log: https://ci.FreeBSD.org/job/FreeBSD-main-amd64-test/25924/console Status explanation: "Unstable" - some tests are suspected being broken by the following changes "Still Unstable" - the failing test cases have not been fixed by these following changes and this is a notification to note that these changes have not been fully tested by the CI system Change summaries: (Those commits are likely but not certainly responsible) 101e825e551afc69a7cebb78fa6b676d38d93d2d by jhb: arm64: Refine comment about size of struct pmap_large_md_page The failed test cases: 8 tests failed. FAILED: usr.sbin.syslogd.syslogd_test.allowed_peer Error Message: atf-check failed; see the output of the test for details FAILED: usr.sbin.syslogd.syslogd_test.allowed_peer_forwarding Error Message: atf-check failed; see the output of the test for details FAILED: usr.sbin.syslogd.syslogd_test.allowed_peer_wildcard Error Message: atf-check failed; see the output of the test for details FAILED: usr.sbin.syslogd.syslogd_test.forward Error Message: atf-check failed; see the output of the test for details FAILED: lib.csu.dynamiclib.cxx_constructors.__test_cases_list__ Error Message: Test program did not exit cleanly FAILED: lib.csu.dynamiclib.fini_test.__test_cases_list__ Error Message: Test program did not exit cleanly FAILED: lib.csu.dynamiclib.init_test.__test_cases_list__ Error Message: Test program did not exit cleanly FAILED: sys.net.routing.test_routing_l3.py.TestIfOps::test_change_prefix_route[inet] Error Message: /usr/tests/sys/net/routing/test_routing_l3.py:42: AssertionError