FreeBSD-main-amd64-test - Build #25997 - Still Unstable

From: <jenkins-admin_at_FreeBSD.org>
Date: Wed, 05 Feb 2025 12:17:33 UTC
FreeBSD-main-amd64-test - Build #25997 (6f659c9a49a01b6451edc169534375479f402f6a) - Still Unstable

Build information: https://ci.FreeBSD.org/job/FreeBSD-main-amd64-test/25997/
Full change log: https://ci.FreeBSD.org/job/FreeBSD-main-amd64-test/25997/changes
Full build log: https://ci.FreeBSD.org/job/FreeBSD-main-amd64-test/25997/console

Status explanation:
"Unstable" - some tests are suspected being broken by the following changes
"Still Unstable" - the failing test cases have not been fixed by these
                   following changes and this is a notification to note that
                   these changes have not been fully tested by the CI system

Change summaries:
(Those commits are likely but not certainly responsible)

5deab77bb6d119dd171385d144a622e7ba7108fe by imp:
bce: Fix register dumping to skip blank area

5a8caf9bfae280614ebd98df894a9d895aacd876 by imp:
bce: make compile with BCE_DEBUG

d889926162b4a8575bd554416b5f1a987ce68a83 by imp:
isci: Remove dead code

6f659c9a49a01b6451edc169534375479f402f6a by imp:
pci: Change device to function



The failed test cases:

4 tests failed.
FAILED:  lib.csu.dynamiclib.cxx_constructors.__test_cases_list__

Error Message:
Test program did not exit cleanly

FAILED:  lib.csu.dynamiclib.fini_test.__test_cases_list__

Error Message:
Test program did not exit cleanly

FAILED:  lib.csu.dynamiclib.init_test.__test_cases_list__

Error Message:
Test program did not exit cleanly

FAILED:  sys.net.routing.test_routing_l3.py.TestIfOps::test_change_prefix_route[inet]

Error Message:
/usr/tests/sys/net/routing/test_routing_l3.py:42: AssertionError