FreeBSD-main-amd64-test - Build #25844 - Still Unstable
Date: Mon, 16 Dec 2024 22:12:57 UTC
FreeBSD-main-amd64-test - Build #25844 (35a2229b67914ff1a4bae6334ad5015aa603967a) - Still Unstable Build information: https://ci.FreeBSD.org/job/FreeBSD-main-amd64-test/25844/ Full change log: https://ci.FreeBSD.org/job/FreeBSD-main-amd64-test/25844/changes Full build log: https://ci.FreeBSD.org/job/FreeBSD-main-amd64-test/25844/console Status explanation: "Unstable" - some tests are suspected being broken by the following changes "Still Unstable" - the failing test cases have not been fixed by these following changes and this is a notification to note that these changes have not been fully tested by the CI system Change summaries: (Those commits are likely but not certainly responsible) 487788a69fa2bd57ee04f38c3ad6e995a62d8e00 by mhorne: intrng: fix INTR_ROOT_* constants a9722e5ae8519a9a28e950dbd8d489178e9bc27e by olce: atomics: Constify loads: Fix powerpc build ce3fbcdd14a1a2ef90890fb8da9592fb4c349b35 by mhorne: jh7110: Add sys clocks for STG & PCIE 35a2229b67914ff1a4bae6334ad5015aa603967a by mhorne: Add StarFive JH7110's STG clocks The failed test cases: 4 tests failed. FAILED: lib.csu.dynamiclib.cxx_constructors.__test_cases_list__ Error Message: Test program did not exit cleanly FAILED: lib.csu.dynamiclib.fini_test.__test_cases_list__ Error Message: Test program did not exit cleanly FAILED: lib.csu.dynamiclib.init_test.__test_cases_list__ Error Message: Test program did not exit cleanly FAILED: sys.net.routing.test_routing_l3.py.TestIfOps::test_change_prefix_route[inet] Error Message: /usr/tests/sys/net/routing/test_routing_l3.py:42: AssertionError