FreeBSD-main-amd64-gcc12_build - Build #620 - Still Failing

From: <jenkins-admin_at_FreeBSD.org>
Date: Thu, 16 Mar 2023 04:10:19 UTC
FreeBSD-main-amd64-gcc12_build - Build #620 (cee09bda03c8be540f1c02d933db714ee2bd6ec7) - Still Failing

Build information: https://ci.FreeBSD.org/job/FreeBSD-main-amd64-gcc12_build/620/
Full change log: https://ci.FreeBSD.org/job/FreeBSD-main-amd64-gcc12_build/620/changes
Full build log: https://ci.FreeBSD.org/job/FreeBSD-main-amd64-gcc12_build/620/console

Status explanation:
"Failure" - the build is suspected being broken by the following changes
"Still Failing" - the build has not been fixed by the following changes and
                  this is a notification to note that these changes have
                  not been fully tested by the CI system

Change summaries:
(Those commits are likely but not certainly responsible)

73ae25c174b515616050496dea764a943796efef by melifaro:
netlink: improve snl(3)

6026b45aabb3324934d076db53b48c50ce30a63d by tuexen:
sctp: improve negotiation of zero checksum feature

cee09bda03c8be540f1c02d933db714ee2bd6ec7 by tuexen:
sctp: allow disabling of SCTP_ACCEPT_ZERO_CHECKSUM socket option



The end of the build log:

[...truncated 82.14 MB...]
--- iov.o ---
/usr/local/bin/x86_64-unknown-freebsd13.1-gcc12 --sysroot=/tmp/obj/workspace/src/amd64.amd64/tmp -B/usr/local/x86_64-unknown-freebsd13.1/bin/  -O2 -pipe -fno-common   -I/workspace/src/usr.sbin/bhyve/../../contrib/lib9p -I/workspace/src/sys -DINET -DINET6 -DNETGRAPH -I/workspace/src/sys/dev/e1000 -I/workspace/src/sys/dev/mii -I/workspace/src/sys/dev/usb/controller -fPIE -g -MD  -MF.depend.iov.o -MTiov.o -std=gnu99 -Wno-format-zero-length -fstack-protector-strong -Wsystem-headers -Werror -Wall -Wno-format-y2k -W -Wno-unused-parameter -Wmissing-prototypes -Wpointer-arith -Wreturn-type -Wcast-qual -Wwrite-strings -Wswitch -Wshadow -Wunused-parameter -Wchar-subscripts -Wnested-externs -Wold-style-definition -Wno-pointer-sign -Wdate-time -Wno-error=address -Wno-error=array-bounds -Wno-error=attributes -Wno-error=bool-compare -Wno-error=cast-align -Wno-error=clobbered -Wno-error=deprecated-declarations -Wno-error=enum-compare -Wno-error=extra -Wno-error=logical-not-parentheses -Wno-error=strict-aliasing -Wno-error=uninitialized -Wno-error=unused-but-set-variable -Wno-error=unused-function -Wno-error=unused-value -Wno-error=empty-body -Wno-error=maybe-uninitialized -Wno-error=nonnull-compare -Wno-error=shift-negative-value -Wno-error=tautological-compare -Wno-error=unused-const-variable -Wno-error=bool-operation -Wno-error=deprecated -Wno-error=expansion-to-defined -Wno-error=format-overflow -Wno-error=format-truncation -Wno-error=implicit-fallthrough -Wno-error=int-in-bool-context -Wno-error=memset-elt-size -Wno-error=noexcept-type -Wno-error=nonnull -Wno-error=pointer-compare -Wno-error=stringop-overflow -Wno-error=aggressive-loop-optimizations -Wno-error=cast-function-type -Wno-error=catch-value -Wno-error=multistatement-macros -Wno-error=restrict -Wno-error=sizeof-pointer-memaccess -Wno-error=stringop-truncation -Wno-return-type       -c /workspace/src/usr.sbin/bhyve/iov.c -o iov.o
--- all_subdir_usr.bin ---
--- mem.o ---
--- all_subdir_usr.sbin ---
--- vmm_instruction_emul.o ---
--- all_subdir_usr.bin ---
/usr/local/bin/x86_64-unknown-freebsd13.1-gcc12 --sysroot=/tmp/obj/workspace/src/amd64.amd64/tmp -B/usr/local/x86_64-unknown-freebsd13.1/bin/  -O2 -pipe -fno-common   -fPIE -g -MD  -MF.depend.mem.o -MTmem.o -std=c11 -Wno-format-zero-length -fstack-protector-strong -Wsystem-headers -Werror -Wall -Wno-format-y2k -W -Wno-unused-parameter -Wmissing-prototypes -Wpointer-arith -Wreturn-type -Wcast-qual -Wwrite-strings -Wswitch -Wshadow -Wunused-parameter -Wcast-align -Wchar-subscripts -Wnested-externs -Wold-style-definition -Wno-pointer-sign -Wdate-time -Wno-error=address -Wno-error=array-bounds -Wno-error=attributes -Wno-error=bool-compare -Wno-error=cast-align -Wno-error=clobbered -Wno-error=deprecated-declarations -Wno-error=enum-compare -Wno-error=extra -Wno-error=logical-not-parentheses -Wno-error=strict-aliasing -Wno-error=uninitialized -Wno-error=unused-but-set-variable -Wno-error=unused-function -Wno-error=unused-value -Wno-error=empty-body -Wno-error=maybe-uninitialized -Wno-error=nonnull-compare -Wno-error=shift-negative-value -Wno-error=tautological-compare -Wno-error=unused-const-variable -Wno-error=bool-operation -Wno-error=deprecated -Wno-error=expansion-to-defined -Wno-error=format-overflow -Wno-error=format-truncation -Wno-error=implicit-fallthrough -Wno-error=int-in-bool-context -Wno-error=memset-elt-size -Wno-error=noexcept-type -Wno-error=nonnull -Wno-error=pointer-compare -Wno-error=stringop-overflow -Wno-error=aggressive-loop-optimizations -Wno-error=cast-function-type -Wno-error=catch-value -Wno-error=multistatement-macros -Wno-error=restrict -Wno-error=sizeof-pointer-memaccess -Wno-error=stringop-truncation -Wno-return-type       -c /workspace/src/usr.bin/sort/mem.c -o mem.o
--- all_subdir_usr.sbin ---
/usr/local/bin/x86_64-unknown-freebsd13.1-gcc12 --sysroot=/tmp/obj/workspace/src/amd64.amd64/tmp -B/usr/local/x86_64-unknown-freebsd13.1/bin/  -O2 -pipe -fno-common   -I/workspace/src/usr.sbin/bhyve/../../contrib/lib9p -I/workspace/src/sys -DINET -DINET6 -DNETGRAPH -I/workspace/src/sys/dev/e1000 -I/workspace/src/sys/dev/mii -I/workspace/src/sys/dev/usb/controller -fPIE -g -MD  -MF.depend.vmm_instruction_emul.o -MTvmm_instruction_emul.o -std=gnu99 -Wno-format-zero-length -fstack-protector-strong -Wsystem-headers -Werror -Wall -Wno-format-y2k -W -Wno-unused-parameter -Wmissing-prototypes -Wpointer-arith -Wreturn-type -Wcast-qual -Wwrite-strings -Wswitch -Wshadow -Wunused-parameter -Wchar-subscripts -Wnested-externs -Wold-style-definition -Wno-pointer-sign -Wdate-time -Wno-error=address -Wno-error=array-bounds -Wno-error=attributes -Wno-error=bool-compare -Wno-error=cast-align -Wno-error=clobbered -Wno-error=deprecated-declarations -Wno-error=enum-compare -Wno-error=extra -Wno-error=logical-not-parentheses -Wno-error=strict-aliasing -Wno-error=uninitialized -Wno-error=unused-but-set-variable -Wno-error=unused-function -Wno-error=unused-value -Wno-error=empty-body -Wno-error=maybe-uninitialized -Wno-error=nonnull-compare -Wno-error=shift-negative-value -Wno-error=tautological-compare -Wno-error=unused-const-variable -Wno-error=bool-operation -Wno-error=deprecated -Wno-error=expansion-to-defined -Wno-error=format-overflow -Wno-error=format-truncation -Wno-error=implicit-fallthrough -Wno-error=int-in-bool-context -Wno-error=memset-elt-size -Wno-error=noexcept-type -Wno-error=nonnull -Wno-error=pointer-compare -Wno-error=stringop-overflow -Wno-error=aggressive-loop-optimizations -Wno-error=cast-function-type -Wno-error=catch-value -Wno-error=multistatement-macros -Wno-error=restrict -Wno-error=sizeof-pointer-memaccess -Wno-error=stringop-truncation -Wno-return-type       -c /workspace/src/sys/amd64/vmm/vmm_instruction_emul.c -o vmm_instruction_emul.o
--- all_subdir_usr.bin ---
--- radixsort.o ---
/usr/local/bin/x86_64-unknown-freebsd13.1-gcc12 --sysroot=/tmp/obj/workspace/src/amd64.amd64/tmp -B/usr/local/x86_64-unknown-freebsd13.1/bin/  -O2 -pipe -fno-common   -fPIE -g -MD  -MF.depend.radixsort.o -MTradixsort.o -std=c11 -Wno-format-zero-length -fstack-protector-strong -Wsystem-headers -Werror -Wall -Wno-format-y2k -W -Wno-unused-parameter -Wmissing-prototypes -Wpointer-arith -Wreturn-type -Wcast-qual -Wwrite-strings -Wswitch -Wshadow -Wunused-parameter -Wcast-align -Wchar-subscripts -Wnested-externs -Wold-style-definition -Wno-pointer-sign -Wdate-time -Wno-error=address -Wno-error=array-bounds -Wno-error=attributes -Wno-error=bool-compare -Wno-error=cast-align -Wno-error=clobbered -Wno-error=deprecated-declarations -Wno-error=enum-compare -Wno-error=extra -Wno-error=logical-not-parentheses -Wno-error=strict-aliasing -Wno-error=uninitialized -Wno-error=unused-but-set-variable -Wno-error=unused-function -Wno-error=unused-value -Wno-error=empty-body -Wno-error=maybe-uninitialized -Wno-error=nonnull-compare -Wno-error=shift-negative-value -Wno-error=tautological-compare -Wno-error=unused-const-variable -Wno-error=bool-operation -Wno-error=deprecated -Wno-error=expansion-to-defined -Wno-error=format-overflow -Wno-error=format-truncation -Wno-error=implicit-fallthrough -Wno-error=int-in-bool-context -Wno-error=memset-elt-size -Wno-error=noexcept-type -Wno-error=nonnull -Wno-error=pointer-compare -Wno-error=stringop-overflow -Wno-error=aggressive-loop-optimizations -Wno-error=cast-function-type -Wno-error=catch-value -Wno-error=multistatement-macros -Wno-error=restrict -Wno-error=sizeof-pointer-memaccess -Wno-error=stringop-truncation -Wno-return-type       -c /workspace/src/usr.bin/sort/radixsort.c -o radixsort.o
--- all_subdir_usr.sbin ---
--- all_subdir_usr.sbin/acpi ---
--- hwpci.o ---
/usr/local/bin/x86_64-unknown-freebsd13.1-gcc12 --sysroot=/tmp/obj/workspace/src/amd64.amd64/tmp -B/usr/local/x86_64-unknown-freebsd13.1/bin/  -O2 -pipe -fno-common -DACPI_DB_APP -DACPI_EXEC_APP -fno-strict-aliasing   -I/workspace/src/sys -fPIE -g -MD  -MF.depend.hwpci.o -MThwpci.o -std=gnu99 -Wno-format-zero-length -fstack-protector-strong -Wsystem-headers -Werror -Wall -Wno-format-y2k -W -Wno-unused-parameter -Wmissing-prototypes -Wpointer-arith -Wno-uninitialized -Wno-pointer-sign -Wdate-time -Wno-error=address -Wno-error=array-bounds -Wno-error=attributes -Wno-error=bool-compare -Wno-error=cast-align -Wno-error=clobbered -Wno-error=deprecated-declarations -Wno-error=enum-compare -Wno-error=extra -Wno-error=logical-not-parentheses -Wno-error=strict-aliasing -Wno-error=uninitialized -Wno-error=unused-but-set-variable -Wno-error=unused-function -Wno-error=unused-value -Wno-error=empty-body -Wno-error=maybe-uninitialized -Wno-error=nonnull-compare -Wno-error=shift-negative-value -Wno-error=tautological-compare -Wno-error=unused-const-variable -Wno-error=bool-operation -Wno-error=deprecated -Wno-error=expansion-to-defined -Wno-error=format-overflow -Wno-error=format-truncation -Wno-error=implicit-fallthrough -Wno-error=int-in-bool-context -Wno-error=memset-elt-size -Wno-error=noexcept-type -Wno-error=nonnull -Wno-error=pointer-compare -Wno-error=stringop-overflow -Wno-error=aggressive-loop-optimizations -Wno-error=cast-function-type -Wno-error=catch-value -Wno-error=multistatement-macros -Wno-error=restrict -Wno-error=sizeof-pointer-memaccess -Wno-error=stringop-truncation -Wno-return-type -Wno-address-of-packed-member      -c /workspace/src/sys/contrib/dev/acpica/components/hardware/hwpci.c -o hwpci.o
--- hwregs.o ---
/usr/local/bin/x86_64-unknown-freebsd13.1-gcc12 --sysroot=/tmp/obj/workspace/src/amd64.amd64/tmp -B/usr/local/x86_64-unknown-freebsd13.1/bin/  -O2 -pipe -fno-common -DACPI_DB_APP -DACPI_EXEC_APP -fno-strict-aliasing   -I/workspace/src/sys -fPIE -g -MD  -MF.depend.hwregs.o -MThwregs.o -std=gnu99 -Wno-format-zero-length -fstack-protector-strong -Wsystem-headers -Werror -Wall -Wno-format-y2k -W -Wno-unused-parameter -Wmissing-prototypes -Wpointer-arith -Wno-uninitialized -Wno-pointer-sign -Wdate-time -Wno-error=address -Wno-error=array-bounds -Wno-error=attributes -Wno-error=bool-compare -Wno-error=cast-align -Wno-error=clobbered -Wno-error=deprecated-declarations -Wno-error=enum-compare -Wno-error=extra -Wno-error=logical-not-parentheses -Wno-error=strict-aliasing -Wno-error=uninitialized -Wno-error=unused-but-set-variable -Wno-error=unused-function -Wno-error=unused-value -Wno-error=empty-body -Wno-error=maybe-uninitialized -Wno-error=nonnull-compare -Wno-error=shift-negative-value -Wno-error=tautological-compare -Wno-error=unused-const-variable -Wno-error=bool-operation -Wno-error=deprecated -Wno-error=expansion-to-defined -Wno-error=format-overflow -Wno-error=format-truncation -Wno-error=implicit-fallthrough -Wno-error=int-in-bool-context -Wno-error=memset-elt-size -Wno-error=noexcept-type -Wno-error=nonnull -Wno-error=pointer-compare -Wno-error=stringop-overflow -Wno-error=aggressive-loop-optimizations -Wno-error=cast-function-type -Wno-error=catch-value -Wno-error=multistatement-macros -Wno-error=restrict -Wno-error=sizeof-pointer-memaccess -Wno-error=stringop-truncation -Wno-return-type -Wno-address-of-packed-member      -c /workspace/src/sys/contrib/dev/acpica/components/hardware/hwregs.c -o hwregs.o
--- all_subdir_lib ---
--- googletest-param-test-test ---
In file included from /tmp/obj/workspace/src/amd64.amd64/tmp/usr/include/c++/v1/__memory/construct_at.h:17,
                 from /tmp/obj/workspace/src/amd64.amd64/tmp/usr/include/c++/v1/__bit_reference:19,
                 from /tmp/obj/workspace/src/amd64.amd64/tmp/usr/include/c++/v1/bitset:117:
/tmp/obj/workspace/src/amd64.amd64/tmp/usr/include/c++/v1/__memory/voidify.h:23:81: warning: 'always_inline' function might not be inlinable [-Wattributes]
   23 | _LIBCPP_ALWAYS_INLINE _LIBCPP_HIDE_FROM_ABI _LIBCPP_CONSTEXPR_AFTER_CXX17 void* __voidify(_Tp& __from) {
      |                                                                                 ^~~~~~~~~
/tmp/obj/workspace/src/amd64.amd64/tmp/usr/include/c++/v1/__memory/voidify.h:23:81: warning: 'always_inline' function might not be inlinable [-Wattributes]
In file included from /tmp/obj/workspace/src/amd64.amd64/tmp/usr/include/c++/v1/__memory/ranges_uninitialized_algorithms.h:22,
                 from /tmp/obj/workspace/src/amd64.amd64/tmp/usr/include/c++/v1/memory:858:
/tmp/obj/workspace/src/amd64.amd64/tmp/usr/include/c++/v1/__memory/uninitialized_algorithms.h:504:1: warning: 'always_inline' function might not be inlinable [-Wattributes]
  504 | __allocator_destroy(_Alloc& __alloc, _Iter __first, _Sent __last) {
      | ^~~~~~~~~~~~~~~~~~~
/tmp/obj/workspace/src/amd64.amd64/tmp/usr/include/c++/v1/__memory/uninitialized_algorithms.h:504:1: warning: 'always_inline' function might not be inlinable [-Wattributes]
/tmp/obj/workspace/src/amd64.amd64/tmp/usr/include/c++/v1/__memory/uninitialized_algorithms.h:504:1: warning: 'always_inline' function might not be inlinable [-Wattributes]
/tmp/obj/workspace/src/amd64.amd64/tmp/usr/include/c++/v1/__memory/uninitialized_algorithms.h:565:1: warning: 'always_inline' function might not be inlinable [-Wattributes]
  565 | __uninitialized_allocator_copy(_Alloc&, const _Type* __first1, const _Type* __last1, _Type* __first2) {
      | ^~~~~~~~~~~~~~~~~~~~~~~~~~~~~~
/tmp/obj/workspace/src/amd64.amd64/tmp/usr/include/c++/v1/__memory/uninitialized_algorithms.h:585:60: warning: 'always_inline' function might not be inlinable [-Wattributes]
  585 | _LIBCPP_HIDE_FROM_ABI _LIBCPP_CONSTEXPR_AFTER_CXX17 _Iter2 __uninitialized_allocator_move_if_noexcept(
      |                                                            ^~~~~~~~~~~~~~~~~~~~~~~~~~~~~~~~~~~~~~~~~~
/tmp/obj/workspace/src/amd64.amd64/tmp/usr/include/c++/v1/__memory/uninitialized_algorithms.h:585:60: warning: 'always_inline' function might not be inlinable [-Wattributes]
/tmp/obj/workspace/src/amd64.amd64/tmp/usr/include/c++/v1/__memory/uninitialized_algorithms.h:585:60: warning: 'always_inline' function might not be inlinable [-Wattributes]
In file included from /tmp/obj/workspace/src/amd64.amd64/tmp/usr/include/c++/v1/__memory/shared_ptr.h:39:
/tmp/obj/workspace/src/amd64.amd64/tmp/usr/include/c++/v1/atomic:616:6: warning: 'always_inline' function might not be inlinable [-Wattributes]
  616 | bool __cxx_nonatomic_compare_equal(_Tp const& __lhs, _Tp const& __rhs) {
      |      ^~~~~~~~~~~~~~~~~~~~~~~~~~~~~
In file included from /tmp/obj/workspace/src/amd64.amd64/tmp/usr/include/c++/v1/atomic:525:
/tmp/obj/workspace/src/amd64.amd64/tmp/usr/include/c++/v1/__thread/poll_with_backoff.h:41:6: warning: 'always_inline' function might not be inlinable [-Wattributes]
   41 | bool __libcpp_thread_poll_with_backoff(_Fn&& __f, _BFn&& __bf, chrono::nanoseconds __max_elapsed = chrono::nanoseconds::zero()) {
      |      ^~~~~~~~~~~~~~~~~~~~~~~~~~~~~~~~~
/tmp/obj/workspace/src/amd64.amd64/tmp/usr/include/c++/v1/__thread/poll_with_backoff.h:41:6: warning: 'always_inline' function might not be inlinable [-Wattributes]
In file included from /tmp/obj/workspace/src/amd64.amd64/tmp/usr/include/c++/v1/string:533:
/tmp/obj/workspace/src/amd64.amd64/tmp/usr/include/c++/v1/__iterator/wrap_iter.h:245:6: warning: 'always_inline' function might not be inlinable [-Wattributes]
  245 | auto operator-(const __wrap_iter<_Iter1>& __x, const __wrap_iter<_Iter2>& __y) _NOEXCEPT
      |      ^~~~~~~~
/tmp/obj/workspace/src/amd64.amd64/tmp/usr/include/c++/v1/atomic:1485:32: warning: 'always_inline' function might not be inlinable [-Wattributes]
 1485 | _LIBCPP_INLINE_VISIBILITY bool __cxx_atomic_wait(_Atp* __a, _Fn && __test_fn)
      |                                ^~~~~~~~~~~~~~~~~
/tmp/obj/workspace/src/amd64.amd64/tmp/usr/include/c++/v1/atomic:1485:32: warning: 'always_inline' function might not be inlinable [-Wattributes]
/tmp/obj/workspace/src/amd64.amd64/tmp/usr/include/c++/v1/atomic:1523:32: warning: 'always_inline' function might not be inlinable [-Wattributes]
 1523 | _LIBCPP_INLINE_VISIBILITY bool __cxx_atomic_wait(_Atp* __a, _Tp const __val, memory_order __order)
      |                                ^~~~~~~~~~~~~~~~~
/tmp/obj/workspace/src/amd64.amd64/tmp/usr/include/c++/v1/atomic:1523:32: warning: 'always_inline' function might not be inlinable [-Wattributes]
/tmp/obj/workspace/src/amd64.amd64/tmp/usr/include/c++/v1/atomic:714:6: warning: 'always_inline' function might not be inlinable [-Wattributes]
  714 | void __cxx_atomic_store(__cxx_atomic_base_impl<_Tp>* __a,  _Tp __val,
      |      ^~~~~~~~~~~~~~~~~~
/tmp/obj/workspace/src/amd64.amd64/tmp/usr/include/c++/v1/atomic:706:6: warning: 'always_inline' function might not be inlinable [-Wattributes]
  706 | void __cxx_atomic_store(volatile __cxx_atomic_base_impl<_Tp>* __a,  _Tp __val,
      |      ^~~~~~~~~~~~~~~~~~
/tmp/obj/workspace/src/amd64.amd64/tmp/usr/include/c++/v1/atomic:751:5: warning: 'always_inline' function might not be inlinable [-Wattributes]
  751 | _Tp __cxx_atomic_exchange(__cxx_atomic_base_impl<_Tp>* __a, _Tp __value,
      |     ^~~~~~~~~~~~~~~~~~~~~
/tmp/obj/workspace/src/amd64.amd64/tmp/usr/include/c++/v1/atomic:741:5: warning: 'always_inline' function might not be inlinable [-Wattributes]
  741 | _Tp __cxx_atomic_exchange(volatile __cxx_atomic_base_impl<_Tp>* __a,
      |     ^~~~~~~~~~~~~~~~~~~~~
/tmp/obj/workspace/src/amd64.amd64/tmp/usr/include/c++/v1/atomic:732:5: warning: 'always_inline' function might not be inlinable [-Wattributes]
  732 | _Tp __cxx_atomic_load(const __cxx_atomic_base_impl<_Tp>* __a, memory_order __order) {
      |     ^~~~~~~~~~~~~~~~~
/tmp/obj/workspace/src/amd64.amd64/tmp/usr/include/c++/v1/atomic:722:5: warning: 'always_inline' function might not be inlinable [-Wattributes]
  722 | _Tp __cxx_atomic_load(const volatile __cxx_atomic_base_impl<_Tp>* __a,
      |     ^~~~~~~~~~~~~~~~~
In file included from /tmp/obj/workspace/src/amd64.amd64/tmp/usr/include/c++/v1/__memory/allocator.h:18,
                 from /tmp/obj/workspace/src/amd64.amd64/tmp/usr/include/c++/v1/memory:848:
/tmp/obj/workspace/src/amd64.amd64/tmp/usr/include/c++/v1/new:254:6: warning: 'always_inline' function might not be inlinable [-Wattributes]
  254 | void __libcpp_operator_delete(_Args ...__args) {
      |      ^~~~~~~~~~~~~~~~~~~~~~~~
/tmp/obj/workspace/src/amd64.amd64/tmp/usr/include/c++/v1/new:277:6: warning: 'always_inline' function might not be inlinable [-Wattributes]
  277 | void __do_deallocate_handle_size(void *__ptr, size_t __size, _Args ...__args) {
      |      ^~~~~~~~~~~~~~~~~~~~~~~~~~~
/tmp/obj/workspace/src/amd64.amd64/tmp/usr/include/c++/v1/new:244:7: warning: 'always_inline' function might not be inlinable [-Wattributes]
  244 | void* __libcpp_operator_new(_Args ...__args) {
      |       ^~~~~~~~~~~~~~~~~~~~~
--- all_subdir_usr.bin ---
--- sort.o ---
/usr/local/bin/x86_64-unknown-freebsd13.1-gcc12 --sysroot=/tmp/obj/workspace/src/amd64.amd64/tmp -B/usr/local/x86_64-unknown-freebsd13.1/bin/  -O2 -pipe -fno-common   -fPIE -g -MD  -MF.depend.sort.o -MTsort.o -std=c11 -Wno-format-zero-length -fstack-protector-strong -Wsystem-headers -Werror -Wall -Wno-format-y2k -W -Wno-unused-parameter -Wmissing-prototypes -Wpointer-arith -Wreturn-type -Wcast-qual -Wwrite-strings -Wswitch -Wshadow -Wunused-parameter -Wcast-align -Wchar-subscripts -Wnested-externs -Wold-style-definition -Wno-pointer-sign -Wdate-time -Wno-error=address -Wno-error=array-bounds -Wno-error=attributes -Wno-error=bool-compare -Wno-error=cast-align -Wno-error=clobbered -Wno-error=deprecated-declarations -Wno-error=enum-compare -Wno-error=extra -Wno-error=logical-not-parentheses -Wno-error=strict-aliasing -Wno-error=uninitialized -Wno-error=unused-but-set-variable -Wno-error=unused-function -Wno-error=unused-value -Wno-error=empty-body -Wno-error=maybe-uninitialized -Wno-error=nonnull-compare -Wno-error=shift-negative-value -Wno-error=tautological-compare -Wno-error=unused-const-variable -Wno-error=bool-operation -Wno-error=deprecated -Wno-error=expansion-to-defined -Wno-error=format-overflow -Wno-error=format-truncation -Wno-error=implicit-fallthrough -Wno-error=int-in-bool-context -Wno-error=memset-elt-size -Wno-error=noexcept-type -Wno-error=nonnull -Wno-error=pointer-compare -Wno-error=stringop-overflow -Wno-error=aggressive-loop-optimizations -Wno-error=cast-function-type -Wno-error=catch-value -Wno-error=multistatement-macros -Wno-error=restrict -Wno-error=sizeof-pointer-memaccess -Wno-error=stringop-truncation -Wno-return-type       -c /workspace/src/usr.bin/sort/sort.c -o sort.o
--- all_subdir_usr.sbin ---
--- hwsleep.o ---
/usr/local/bin/x86_64-unknown-freebsd13.1-gcc12 --sysroot=/tmp/obj/workspace/src/amd64.amd64/tmp -B/usr/local/x86_64-unknown-freebsd13.1/bin/  -O2 -pipe -fno-common -DACPI_DB_APP -DACPI_EXEC_APP -fno-strict-aliasing   -I/workspace/src/sys -fPIE -g -MD  -MF.depend.hwsleep.o -MThwsleep.o -std=gnu99 -Wno-format-zero-length -fstack-protector-strong -Wsystem-headers -Werror -Wall -Wno-format-y2k -W -Wno-unused-parameter -Wmissing-prototypes -Wpointer-arith -Wno-uninitialized -Wno-pointer-sign -Wdate-time -Wno-error=address -Wno-error=array-bounds -Wno-error=attributes -Wno-error=bool-compare -Wno-error=cast-align -Wno-error=clobbered -Wno-error=deprecated-declarations -Wno-error=enum-compare -Wno-error=extra -Wno-error=logical-not-parentheses -Wno-error=strict-aliasing -Wno-error=uninitialized -Wno-error=unused-but-set-variable -Wno-error=unused-function -Wno-error=unused-value -Wno-error=empty-body -Wno-error=maybe-uninitialized -Wno-error=nonnull-compare -Wno-error=shift-negative-value -Wno-error=tautological-compare -Wno-error=unused-const-variable -Wno-error=bool-operation -Wno-error=deprecated -Wno-error=expansion-to-defined -Wno-error=format-overflow -Wno-error=format-truncation -Wno-error=implicit-fallthrough -Wno-error=int-in-bool-context -Wno-error=memset-elt-size -Wno-error=noexcept-type -Wno-error=nonnull -Wno-error=pointer-compare -Wno-error=stringop-overflow -Wno-error=aggressive-loop-optimizations -Wno-error=cast-function-type -Wno-error=catch-value -Wno-error=multistatement-macros -Wno-error=restrict -Wno-error=sizeof-pointer-memaccess -Wno-error=stringop-truncation -Wno-return-type -Wno-address-of-packed-member      -c /workspace/src/sys/contrib/dev/acpica/components/hardware/hwsleep.c -o hwsleep.o
--- all_subdir_lib ---
--- gtest_repeat_test ---
In file included from /tmp/obj/workspace/src/amd64.amd64/tmp/usr/include/c++/v1/__memory/construct_at.h:17,
                 from /tmp/obj/workspace/src/amd64.amd64/tmp/usr/include/c++/v1/__memory/allocator_traits.h:14,
                 from /tmp/obj/workspace/src/amd64.amd64/tmp/usr/include/c++/v1/__memory/allocate_at_least.h:13,
                 from /tmp/obj/workspace/src/amd64.amd64/tmp/usr/include/c++/v1/memory:846:
/tmp/obj/workspace/src/amd64.amd64/tmp/usr/include/c++/v1/__memory/voidify.h:23:81: warning: 'always_inline' function might not be inlinable [-Wattributes]
   23 | _LIBCPP_ALWAYS_INLINE _LIBCPP_HIDE_FROM_ABI _LIBCPP_CONSTEXPR_AFTER_CXX17 void* __voidify(_Tp& __from) {
      |                                                                                 ^~~~~~~~~
In file included from /tmp/obj/workspace/src/amd64.amd64/tmp/usr/include/c++/v1/__memory/ranges_uninitialized_algorithms.h:22,
                 from /tmp/obj/workspace/src/amd64.amd64/tmp/usr/include/c++/v1/memory:858:
/tmp/obj/workspace/src/amd64.amd64/tmp/usr/include/c++/v1/__memory/uninitialized_algorithms.h:504:1: warning: 'always_inline' function might not be inlinable [-Wattributes]
  504 | __allocator_destroy(_Alloc& __alloc, _Iter __first, _Sent __last) {
      | ^~~~~~~~~~~~~~~~~~~
/tmp/obj/workspace/src/amd64.amd64/tmp/usr/include/c++/v1/__memory/uninitialized_algorithms.h:504:1: warning: 'always_inline' function might not be inlinable [-Wattributes]
/tmp/obj/workspace/src/amd64.amd64/tmp/usr/include/c++/v1/__memory/uninitialized_algorithms.h:504:1: warning: 'always_inline' function might not be inlinable [-Wattributes]
/tmp/obj/workspace/src/amd64.amd64/tmp/usr/include/c++/v1/__memory/uninitialized_algorithms.h:585:60: warning: 'always_inline' function might not be inlinable [-Wattributes]
  585 | _LIBCPP_HIDE_FROM_ABI _LIBCPP_CONSTEXPR_AFTER_CXX17 _Iter2 __uninitialized_allocator_move_if_noexcept(
      |                                                            ^~~~~~~~~~~~~~~~~~~~~~~~~~~~~~~~~~~~~~~~~~
/tmp/obj/workspace/src/amd64.amd64/tmp/usr/include/c++/v1/__memory/uninitialized_algorithms.h:585:60: warning: 'always_inline' function might not be inlinable [-Wattributes]
/tmp/obj/workspace/src/amd64.amd64/tmp/usr/include/c++/v1/__memory/uninitialized_algorithms.h:585:60: warning: 'always_inline' function might not be inlinable [-Wattributes]
In file included from /tmp/obj/workspace/src/amd64.amd64/tmp/usr/include/c++/v1/__memory/shared_ptr.h:39:
/tmp/obj/workspace/src/amd64.amd64/tmp/usr/include/c++/v1/atomic:616:6: warning: 'always_inline' function might not be inlinable [-Wattributes]
  616 | bool __cxx_nonatomic_compare_equal(_Tp const& __lhs, _Tp const& __rhs) {
      |      ^~~~~~~~~~~~~~~~~~~~~~~~~~~~~
In file included from /tmp/obj/workspace/src/amd64.amd64/tmp/usr/include/c++/v1/atomic:525:
/tmp/obj/workspace/src/amd64.amd64/tmp/usr/include/c++/v1/__thread/poll_with_backoff.h:41:6: warning: 'always_inline' function might not be inlinable [-Wattributes]
   41 | bool __libcpp_thread_poll_with_backoff(_Fn&& __f, _BFn&& __bf, chrono::nanoseconds __max_elapsed = chrono::nanoseconds::zero()) {
      |      ^~~~~~~~~~~~~~~~~~~~~~~~~~~~~~~~~
/tmp/obj/workspace/src/amd64.amd64/tmp/usr/include/c++/v1/__thread/poll_with_backoff.h:41:6: warning: 'always_inline' function might not be inlinable [-Wattributes]
In file included from /tmp/obj/workspace/src/amd64.amd64/tmp/usr/include/c++/v1/iterator:717,
                 from /tmp/obj/workspace/src/amd64.amd64/tmp/usr/include/c++/v1/memory:877:
/tmp/obj/workspace/src/amd64.amd64/tmp/usr/include/c++/v1/__iterator/wrap_iter.h:245:6: warning: 'always_inline' function might not be inlinable [-Wattributes]
  245 | auto operator-(const __wrap_iter<_Iter1>& __x, const __wrap_iter<_Iter2>& __y) _NOEXCEPT
      |      ^~~~~~~~
/tmp/obj/workspace/src/amd64.amd64/tmp/usr/include/c++/v1/atomic:1485:32: warning: 'always_inline' function might not be inlinable [-Wattributes]
 1485 | _LIBCPP_INLINE_VISIBILITY bool __cxx_atomic_wait(_Atp* __a, _Fn && __test_fn)
      |                                ^~~~~~~~~~~~~~~~~
/tmp/obj/workspace/src/amd64.amd64/tmp/usr/include/c++/v1/atomic:1485:32: warning: 'always_inline' function might not be inlinable [-Wattributes]
/tmp/obj/workspace/src/amd64.amd64/tmp/usr/include/c++/v1/atomic:1523:32: warning: 'always_inline' function might not be inlinable [-Wattributes]
 1523 | _LIBCPP_INLINE_VISIBILITY bool __cxx_atomic_wait(_Atp* __a, _Tp const __val, memory_order __order)
      |                                ^~~~~~~~~~~~~~~~~
/tmp/obj/workspace/src/amd64.amd64/tmp/usr/include/c++/v1/atomic:1523:32: warning: 'always_inline' function might not be inlinable [-Wattributes]
/tmp/obj/workspace/src/amd64.amd64/tmp/usr/include/c++/v1/atomic:714:6: warning: 'always_inline' function might not be inlinable [-Wattributes]
  714 | void __cxx_atomic_store(__cxx_atomic_base_impl<_Tp>* __a,  _Tp __val,
      |      ^~~~~~~~~~~~~~~~~~
/tmp/obj/workspace/src/amd64.amd64/tmp/usr/include/c++/v1/atomic:706:6: warning: 'always_inline' function might not be inlinable [-Wattributes]
  706 | void __cxx_atomic_store(volatile __cxx_atomic_base_impl<_Tp>* __a,  _Tp __val,
      |      ^~~~~~~~~~~~~~~~~~
/tmp/obj/workspace/src/amd64.amd64/tmp/usr/include/c++/v1/atomic:751:5: warning: 'always_inline' function might not be inlinable [-Wattributes]
  751 | _Tp __cxx_atomic_exchange(__cxx_atomic_base_impl<_Tp>* __a, _Tp __value,
      |     ^~~~~~~~~~~~~~~~~~~~~
/tmp/obj/workspace/src/amd64.amd64/tmp/usr/include/c++/v1/atomic:741:5: warning: 'always_inline' function might not be inlinable [-Wattributes]
  741 | _Tp __cxx_atomic_exchange(volatile __cxx_atomic_base_impl<_Tp>* __a,
      |     ^~~~~~~~~~~~~~~~~~~~~
/tmp/obj/workspace/src/amd64.amd64/tmp/usr/include/c++/v1/atomic:732:5: warning: 'always_inline' function might not be inlinable [-Wattributes]
  732 | _Tp __cxx_atomic_load(const __cxx_atomic_base_impl<_Tp>* __a, memory_order __order) {
      |     ^~~~~~~~~~~~~~~~~
/tmp/obj/workspace/src/amd64.amd64/tmp/usr/include/c++/v1/atomic:722:5: warning: 'always_inline' function might not be inlinable [-Wattributes]
  722 | _Tp __cxx_atomic_load(const volatile __cxx_atomic_base_impl<_Tp>* __a,
      |     ^~~~~~~~~~~~~~~~~
In file included from /tmp/obj/workspace/src/amd64.amd64/tmp/usr/include/c++/v1/__memory/allocator.h:18,
                 from /tmp/obj/workspace/src/amd64.amd64/tmp/usr/include/c++/v1/memory:848:
/tmp/obj/workspace/src/amd64.amd64/tmp/usr/include/c++/v1/new:254:6: warning: 'always_inline' function might not be inlinable [-Wattributes]
  254 | void __libcpp_operator_delete(_Args ...__args) {
      |      ^~~~~~~~~~~~~~~~~~~~~~~~
/tmp/obj/workspace/src/amd64.amd64/tmp/usr/include/c++/v1/new:277:6: warning: 'always_inline' function might not be inlinable [-Wattributes]
  277 | void __do_deallocate_handle_size(void *__ptr, size_t __size, _Args ...__args) {
      |      ^~~~~~~~~~~~~~~~~~~~~~~~~~~
/tmp/obj/workspace/src/amd64.amd64/tmp/usr/include/c++/v1/new:244:7: warning: 'always_inline' function might not be inlinable [-Wattributes]
  244 | void* __libcpp_operator_new(_Args ...__args) {
      |       ^~~~~~~~~~~~~~~~~~~~~
--- all_subdir_usr.bin ---
--- vsort.o ---
/usr/local/bin/x86_64-unknown-freebsd13.1-gcc12 --sysroot=/tmp/obj/workspace/src/amd64.amd64/tmp -B/usr/local/x86_64-unknown-freebsd13.1/bin/  -O2 -pipe -fno-common   -fPIE -g -MD  -MF.depend.vsort.o -MTvsort.o -std=c11 -Wno-format-zero-length -fstack-protector-strong -Wsystem-headers -Werror -Wall -Wno-format-y2k -W -Wno-unused-parameter -Wmissing-prototypes -Wpointer-arith -Wreturn-type -Wcast-qual -Wwrite-strings -Wswitch -Wshadow -Wunused-parameter -Wcast-align -Wchar-subscripts -Wnested-externs -Wold-style-definition -Wno-pointer-sign -Wdate-time -Wno-error=address -Wno-error=array-bounds -Wno-error=attributes -Wno-error=bool-compare -Wno-error=cast-align -Wno-error=clobbered -Wno-error=deprecated-declarations -Wno-error=enum-compare -Wno-error=extra -Wno-error=logical-not-parentheses -Wno-error=strict-aliasing -Wno-error=uninitialized -Wno-error=unused-but-set-variable -Wno-error=unused-function -Wno-error=unused-value -Wno-error=empty-body -Wno-error=maybe-uninitialized -Wno-error=nonnull-compare -Wno-error=shift-negative-value -Wno-error=tautological-compare -Wno-error=unused-const-variable -Wno-error=bool-operation -Wno-error=deprecated -Wno-error=expansion-to-defined -Wno-error=format-overflow -Wno-error=format-truncation -Wno-error=implicit-fallthrough -Wno-error=int-in-bool-context -Wno-error=memset-elt-size -Wno-error=noexcept-type -Wno-error=nonnull -Wno-error=pointer-compare -Wno-error=stringop-overflow -Wno-error=aggressive-loop-optimizations -Wno-error=cast-function-type -Wno-error=catch-value -Wno-error=multistatement-macros -Wno-error=restrict -Wno-error=sizeof-pointer-memaccess -Wno-error=stringop-truncation -Wno-return-type       -c /workspace/src/usr.bin/sort/vsort.c -o vsort.o
--- all_subdir_usr.sbin ---
--- hwvalid.o ---
/usr/local/bin/x86_64-unknown-freebsd13.1-gcc12 --sysroot=/tmp/obj/workspace/src/amd64.amd64/tmp -B/usr/local/x86_64-unknown-freebsd13.1/bin/  -O2 -pipe -fno-common -DACPI_DB_APP -DACPI_EXEC_APP -fno-strict-aliasing   -I/workspace/src/sys -fPIE -g -MD  -MF.depend.hwvalid.o -MThwvalid.o -std=gnu99 -Wno-format-zero-length -fstack-protector-strong -Wsystem-headers -Werror -Wall -Wno-format-y2k -W -Wno-unused-parameter -Wmissing-prototypes -Wpointer-arith -Wno-uninitialized -Wno-pointer-sign -Wdate-time -Wno-error=address -Wno-error=array-bounds -Wno-error=attributes -Wno-error=bool-compare -Wno-error=cast-align -Wno-error=clobbered -Wno-error=deprecated-declarations -Wno-error=enum-compare -Wno-error=extra -Wno-error=logical-not-parentheses -Wno-error=strict-aliasing -Wno-error=uninitialized -Wno-error=unused-but-set-variable -Wno-error=unused-function -Wno-error=unused-value -Wno-error=empty-body -Wno-error=maybe-uninitialized -Wno-error=nonnull-compare -Wno-error=shift-negative-value -Wno-error=tautological-compare -Wno-error=unused-const-variable -Wno-error=bool-operation -Wno-error=deprecated -Wno-error=expansion-to-defined -Wno-error=format-overflow -Wno-error=format-truncation -Wno-error=implicit-fallthrough -Wno-error=int-in-bool-context -Wno-error=memset-elt-size -Wno-error=noexcept-type -Wno-error=nonnull -Wno-error=pointer-compare -Wno-error=stringop-overflow -Wno-error=aggressive-loop-optimizations -Wno-error=cast-function-type -Wno-error=catch-value -Wno-error=multistatement-macros -Wno-error=restrict -Wno-error=sizeof-pointer-memaccess -Wno-error=stringop-truncation -Wno-return-type -Wno-address-of-packed-member      -c /workspace/src/sys/contrib/dev/acpica/components/hardware/hwvalid.c -o hwvalid.o
--- all_subdir_usr.sbin/bhyve ---
--- all_subdir_usr.sbin/bhyve/kbdlayout ---
===> usr.sbin/bhyve/kbdlayout (all)
--- bhyve.full ---
/usr/local/bin/x86_64-unknown-freebsd13.1-gcc12 --sysroot=/tmp/obj/workspace/src/amd64.amd64/tmp -B/usr/local/x86_64-unknown-freebsd13.1/bin/ -O2 -pipe -fno-common -I/workspace/src/usr.sbin/bhyve/../../contrib/lib9p -I/workspace/src/sys -DINET -DINET6 -DNETGRAPH -I/workspace/src/sys/dev/e1000 -I/workspace/src/sys/dev/mii -I/workspace/src/sys/dev/usb/controller -fPIE -g -std=gnu99 -Wno-format-zero-length -fstack-protector-strong -Wsystem-headers -Werror -Wall -Wno-format-y2k -W -Wno-unused-parameter -Wmissing-prototypes -Wpointer-arith -Wreturn-type -Wcast-qual -Wwrite-strings -Wswitch -Wshadow -Wunused-parameter -Wchar-subscripts -Wnested-externs -Wold-style-definition -Wno-pointer-sign -Wdate-time -Wno-error=address -Wno-error=array-bounds -Wno-error=attributes -Wno-error=bool-compare -Wno-error=cast-align -Wno-error=clobbered -Wno-error=deprecated-declarations -Wno-error=enum-compare -Wno-error=extra -Wno-error=logical-not-parentheses -Wno-error=strict-aliasing -Wno-error=uninitialized -Wno-error=unused-but-set-variable -Wno-error=unused-function -Wno-error=unused-value -Wno-error=empty-body -Wno-error=maybe-uninitialized -Wno-error=nonnull-compare -Wno-error=shift-negative-value -Wno-error=tautological-compare -Wno-error=unused-const-variable -Wno-error=bool-operation -Wno-error=deprecated -Wno-error=expansion-to-defined -Wno-error=format-overflow -Wno-error=format-truncation -Wno-error=implicit-fallthrough -Wno-error=int-in-bool-context -Wno-error=memset-elt-size -Wno-error=noexcept-type -Wno-error=nonnull -Wno-error=pointer-compare -Wno-error=stringop-overflow -Wno-error=aggressive-loop-optimizations -Wno-error=cast-function-type -Wno-error=catch-value -Wno-error=multistatement-macros -Wno-error=restrict -Wno-error=sizeof-pointer-memaccess -Wno-error=stringop-truncation -Wno-return-type  -Wl,-zrelro -pie   -o bhyve.full acpi_device.o atkbdc.o acpi.o audio.o basl.o bhyvegc.o bhyverun.o block_if.o bootrom.o config.o console.o ctl_util.o ctl_scsi_all.o fwctl.o gdb.o hda_codec.o inout.o ioapic.o kernemu_dev.o mem.o mevent.o mptbl.o net_backends.o net_utils.o pci_ahci.o pci_e82545.o pci_emul.o pci_hda.o pci_fbuf.o pci_hostbridge.o pci_irq.o pci_lpc.o pci_nvme.o pci_passthru.o pci_virtio_9p.o pci_virtio_block.o pci_virtio_console.o pci_virtio_input.o pci_virtio_net.o pci_virtio_rnd.o pci_virtio_scsi.o pci_uart.o pci_xhci.o pctestdev.o pm.o post.o ps2kbd.o ps2mouse.o rfb.o rtc.o smbiostbl.o sockstream.o task_switch.o uart_emul.o usb_emul.o usb_mouse.o virtio.o vga.o vmgenc.o xmsr.o spinup_ap.o iov.o vmm_instruction_emul.o   -lvmmapi  -lmd  -lnv   -lz  -lutil  -lsbuf  -lcam  -l9p  -lnetgraph  -lcrypto -lpthread 
/usr/local/bin/x86_64-unknown-freebsd13.1-ld: warning: libcap_pwd.so.1, needed by /tmp/obj/workspace/src/amd64.amd64/tmp/usr/lib/lib9p.so, not found (try using -rpath or -rpath-link)
/usr/local/bin/x86_64-unknown-freebsd13.1-ld: warning: libcap_grp.so.1, needed by /tmp/obj/workspace/src/amd64.amd64/tmp/usr/lib/lib9p.so, not found (try using -rpath or -rpath-link)
--- all_subdir_usr.sbin/acpi ---
--- hwxface.o ---
/usr/local/bin/x86_64-unknown-freebsd13.1-gcc12 --sysroot=/tmp/obj/workspace/src/amd64.amd64/tmp -B/usr/local/x86_64-unknown-freebsd13.1/bin/  -O2 -pipe -fno-common -DACPI_DB_APP -DACPI_EXEC_APP -fno-strict-aliasing   -I/workspace/src/sys -fPIE -g -MD  -MF.depend.hwxface.o -MThwxface.o -std=gnu99 -Wno-format-zero-length -fstack-protector-strong -Wsystem-headers -Werror -Wall -Wno-format-y2k -W -Wno-unused-parameter -Wmissing-prototypes -Wpointer-arith -Wno-uninitialized -Wno-pointer-sign -Wdate-time -Wno-error=address -Wno-error=array-bounds -Wno-error=attributes -Wno-error=bool-compare -Wno-error=cast-align -Wno-error=clobbered -Wno-error=deprecated-declarations -Wno-error=enum-compare -Wno-error=extra -Wno-error=logical-not-parentheses -Wno-error=strict-aliasing -Wno-error=uninitialized -Wno-error=unused-but-set-variable -Wno-error=unused-function -Wno-error=unused-value -Wno-error=empty-body -Wno-error=maybe-uninitialized -Wno-error=nonnull-compare -Wno-error=shift-negative-value -Wno-error=tautological-compare -Wno-error=unused-const-variable -Wno-error=bool-operation -Wno-error=deprecated -Wno-error=expansion-to-defined -Wno-error=format-overflow -Wno-error=format-truncation -Wno-error=implicit-fallthrough -Wno-error=int-in-bool-context -Wno-error=memset-elt-size -Wno-error=noexcept-type -Wno-error=nonnull -Wno-error=pointer-compare -Wno-error=stringop-overflow -Wno-error=aggressive-loop-optimizations -Wno-error=cast-function-type -Wno-error=catch-value -Wno-error=multistatement-macros -Wno-error=restrict -Wno-error=sizeof-pointer-memaccess -Wno-error=stringop-truncation -Wno-return-type -Wno-address-of-packed-member      -c /workspace/src/sys/contrib/dev/acpica/components/hardware/hwxface.c -o hwxface.o
--- all_subdir_usr.sbin/bhyve ---
/usr/local/bin/x86_64-unknown-freebsd13.1-ld: /tmp/obj/workspace/src/amd64.amd64/tmp/usr/lib/lib9p.so: undefined reference to `cap_setpassent'
--- all_subdir_usr.bin ---
--- all_subdir_usr.bin/sort/tests ---
===> usr.bin/sort/tests (all)
--- all_subdir_usr.sbin ---
/usr/local/bin/x86_64-unknown-freebsd13.1-ld: /tmp/obj/workspace/src/amd64.amd64/tmp/usr/lib/lib9p.so: undefined reference to `cap_getgrgid_r'
/usr/local/bin/x86_64-unknown-freebsd13.1-ld: /tmp/obj/workspace/src/amd64.amd64/tmp/usr/lib/lib9p.so: undefined reference to `cap_setgroupent'
/usr/local/bin/x86_64-unknown-freebsd13.1-ld: /tmp/obj/workspace/src/amd64.amd64/tmp/usr/lib/lib9p.so: undefined reference to `cap_getpwnam'
/usr/local/bin/x86_64-unknown-freebsd13.1-ld: /tmp/obj/workspace/src/amd64.amd64/tmp/usr/lib/lib9p.so: undefined reference to `cap_getpwuid_r'
collect2: error: ld returned 1 exit status
*** [bhyve.full] Error code 1

make[4]: stopped in /workspace/src/usr.sbin/bhyve
1 error

make[4]: stopped in /workspace/src/usr.sbin/bhyve

make[3]: stopped in /workspace/src/usr.sbin
--- all_subdir_usr.bin ---

make[2]: stopped in /workspace/src
--- all_subdir_tests ---

make[5]: stopped in /workspace/src/tests/sys/fs
--- all_subdir_usr.sbin ---
--- all_subdir_usr.sbin/acpi ---

make[4]: stopped in /workspace/src/usr.sbin/acpi
--- all_subdir_tests ---

make[4]: stopped in /workspace/src/tests/sys
--- all_subdir_usr.sbin ---

make[3]: stopped in /workspace/src/usr.sbin

make[2]: stopped in /workspace/src
--- all_subdir_tests ---

make[3]: stopped in /workspace/src/tests

make[2]: stopped in /workspace/src
--- all_subdir_lib ---

make[2]: stopped in /workspace/src
      157.98 real      1632.78 user       172.61 sys

make[1]: stopped in /workspace/src

make: stopped in /workspace/src
Build step 'Execute shell' marked build as failure
[WARNINGS]Skipping publisher since build result is FAILURE
[PostBuildScript] - [INFO] Executing post build scripts.
[FreeBSD-main-amd64-gcc12_build] $ /bin/sh -xe /tmp/jenkins13361051719063391301.sh
+ sh freebsd-ci/scripts/jail/clean.sh
clean jail FreeBSD-main-amd64-gcc12_build
Checking for post-build
Performing post-build step
Checking if email needs to be generated
Email was triggered for: Failure - Any
Sending email for trigger: Failure - Any
Sending mail from default account using System Admin e-mail address