FreeBSD-main-amd64-test - Build #22622 - Still Unstable

From: <jenkins-admin_at_FreeBSD.org>
Date: Mon, 12 Dec 2022 21:54:14 UTC
FreeBSD-main-amd64-test - Build #22622 (f0878da03b374e3fa3578b363f02bfd50ac0e5bd) - Still Unstable

Build information: https://ci.FreeBSD.org/job/FreeBSD-main-amd64-test/22622/
Full change log: https://ci.FreeBSD.org/job/FreeBSD-main-amd64-test/22622/changes
Full build log: https://ci.FreeBSD.org/job/FreeBSD-main-amd64-test/22622/console

Status explanation:
"Unstable" - some tests are suspected being broken by the following changes
"Still Unstable" - the failing test cases have not been fixed by these
                   following changes and this is a notification to note that
                   these changes have not been fully tested by the CI system

Change summaries:
(Those commits are likely but not certainly responsible)

85dd853236149dd029d5c065efce0e802f9c1e9a by pkubaj:
Revert "uname: switch machine to HW_MACHINE_ARCH"

86edb11e7491e657e6c75ef6814867021665c377 by emaste:
Always install llvm-objdump as objdump

9dda00df7e8f9279a43d92758df6a7e10a9aed95 by chs:
restore: fix restore of NFS4 ACLs

f0878da03b374e3fa3578b363f02bfd50ac0e5bd by alc:
pmap: standardize promotion conditions between amd64 and arm64



The failed test cases:

4 tests failed.
FAILED:  sys.fs.fusefs.mknod.main

Error Message:
Returned non-success exit status 1

FAILED:  sys.kern.ktls_test.ktls_receive_aes128_cbc_1_1_sha1_bad_major

Error Message:
/usr/src/tests/sys/kern/ktls_test.c:1587: errno == expected_error not met

FAILED:  sys.kern.ktls_test.ktls_receive_aes128_cbc_1_1_sha1_bad_minor

Error Message:
/usr/src/tests/sys/kern/ktls_test.c:1587: errno == expected_error not met

FAILED:  sys.kern.ktls_test.ktls_receive_aes128_cbc_1_2_sha384_bad_minor

Error Message:
/usr/src/tests/sys/kern/ktls_test.c:1587: errno == expected_error not met